# Failed build Slicer in Windows10 with Visual Studio 2017,Qt 5.10.1

**URL:** <https://discourse.slicer.org/t/failed-build-slicer-in-windows10-with-visual-studio-2017-qt-5-10-1/19718>\
**Category:** Development\
**Tags:** build, qt\
**Created:** [September 17, 2021, 7:55am UTC](https://discourse.slicer.org/t/failed-build-slicer-in-windows10-with-visual-studio-2017-qt-5-10-1/19718 "2021-09-17T07:55:15Z")\
**Posts on this page:** 20\
**Page:** 1

<div class="post-metadata">

**Author:** ![kookoo9999](https://sea2.discourse-cdn.com/flex002/user_avatar/discourse.slicer.org/kookoo9999/32/12394_2.png) [@kookoo9999](https://discourse.slicer.org/u/kookoo9999)\
**Post date:** [September 17, 2021, 7:55am UTC](https://discourse.slicer.org/t/failed-build-slicer-in-windows10-with-visual-studio-2017-qt-5-10-1/19718/1 "2021-09-17T07:55:15Z")

</div>

I wnat to build Slicer ( 4.11 20200930) on Windows10 but build failed repeatedly.  
In the past , I tried to build Slicer Source(from git “master” branch) but I saw the CMake configuration error occured.(env : Visual Studio 2017,Qt5.15 include Web Engine & Script,CMake 3.15) and then I changed the environment as follows.  
My env is  
Visual Studio 2017  
Qt 5.10.1(include WebEngine,Script)  
CMake 3.15.0-rc1 and Source Code is changed from “master” branch to Slicer-4.11.20200930.  
So I did success to do configuration in CMake.

There is no problem with Configuration in CMake(option Visual Studio 2017,x64) and generate too.  
but when I build the ALL\_BUILD in Slicer.sln , I see the Message of Build Fail 48 out of 54 …

And I can’t find Slicer.exe in directory of Slicer\_build\build\ or Slicer\_build.

Did I do anything wrong?

---

<div class="post-metadata">

**Author:** ![kookoo9999](https://sea2.discourse-cdn.com/flex002/user_avatar/discourse.slicer.org/kookoo9999/32/12394_2.png) [@kookoo9999](https://discourse.slicer.org/u/kookoo9999)\
**Post date:** [September 17, 2021, 7:55am UTC](https://discourse.slicer.org/t/failed-build-slicer-in-windows10-with-visual-studio-2017-qt-5-10-1/19718/2 "2021-09-17T07:55:46Z")

</div>

![image](https://us1.discourse-cdn.com/flex002/uploads/slicer/original/3X/5/6/56e9783aa5c94343599427ea1d3aca16df531be4.png)  
 ![image](https://us1.discourse-cdn.com/flex002/uploads/slicer/original/3X/1/3/13da421558628a74a7e328d29add67b4a51233c7.png)  
 ![image](https://us1.discourse-cdn.com/flex002/uploads/slicer/original/3X/3/5/35ed1c844d607d0ee4d4245aedc2c5b5c417ce94.png)

S4R is Slicer-4.11.20200930 source code.  
All\_Build is failed so I can’t find Slicer.exe.  
I tried to build this [link](https://slicer.readthedocs.io/en/latest/developer_guide/build_instructions/windows.html).

---

<div class="post-metadata">

**Author:** ![lassoan](https://sea2.discourse-cdn.com/flex002/user_avatar/discourse.slicer.org/lassoan/32/13_2.png) [@lassoan](https://discourse.slicer.org/u/lassoan)\
**Post date:** [September 17, 2021, 5:19pm UTC](https://discourse.slicer.org/t/failed-build-slicer-in-windows10-with-visual-studio-2017-qt-5-10-1/19718/3 "2021-09-17T17:19:26Z")

</div>

First I would recommend to build Slicer by following the exact requirements as described in the [build instructions](https://slicer.readthedocs.io/en/latest/developer_guide/build_instructions/windows.html). Once that works, you can try and change the configuration and see if you can use other library versions/compilers.

---

<div class="post-metadata">

**Author:** ![kookoo9999](https://sea2.discourse-cdn.com/flex002/user_avatar/discourse.slicer.org/kookoo9999/32/12394_2.png) [@kookoo9999](https://discourse.slicer.org/u/kookoo9999)\
**Post date:** [September 19, 2021, 7:58am UTC](https://discourse.slicer.org/t/failed-build-slicer-in-windows10-with-visual-studio-2017-qt-5-10-1/19718/4 "2021-09-19T07:58:23Z")

</div>

Previously, we tried “master” branch source code, but build failed…  
And I changed the source code from “master” branch to 4.11 20200930.  
nevertheless build failed , I try to build Slicer via Visual Studio 2019. but I couldn’t see Slicer.exe…

---

<div class="post-metadata">

**Author:** ![kookoo9999](https://sea2.discourse-cdn.com/flex002/user_avatar/discourse.slicer.org/kookoo9999/32/12394_2.png) [@kookoo9999](https://discourse.slicer.org/u/kookoo9999)\
**Post date:** [September 20, 2021, 5:12am UTC](https://discourse.slicer.org/t/failed-build-slicer-in-windows10-with-visual-studio-2017-qt-5-10-1/19718/5 "2021-09-20T05:12:34Z")

</div>

Previously, we tried “master” branch source code, but build failed…  
And I changed the source code from “master” branch to 4.11 20200930.  
nevertheless build failed , I try to build Slicer via Visual Studio 2019. but I couldn’t see Slicer.exe…  
Today I changed the source code version and try to build.  
but always I see the this message “Slicer.vcxproj is build failed”.

---

<div class="post-metadata">

**Author:** ![lassoan](https://sea2.discourse-cdn.com/flex002/user_avatar/discourse.slicer.org/lassoan/32/13_2.png) [@lassoan](https://discourse.slicer.org/u/lassoan)\
**Post date:** [September 20, 2021, 2:25pm UTC](https://discourse.slicer.org/t/failed-build-slicer-in-windows10-with-visual-studio-2017-qt-5-10-1/19718/6 "2021-09-20T14:25:39Z")

</div>

We build Slicer master on many Windows computers, every day, without any issues, by following the build instructions described in the documentation. The issue that breaks the build on your computer must be something trivial, but we need to see the actual error message to tell what exactly is that.

Could you copy-paste here the full text of the very first error message that appears when you build the inner `Slicer` target (`c:\D\S4R\Slicer-build\Slicer.sln` and not `c:\D\S4R\Slicer.sln`)?

---

<div class="post-metadata">

**Author:** ![kookoo9999](https://sea2.discourse-cdn.com/flex002/user_avatar/discourse.slicer.org/kookoo9999/32/12394_2.png) [@kookoo9999](https://discourse.slicer.org/u/kookoo9999)\
**Post date:** [September 21, 2021, 6:10am UTC](https://discourse.slicer.org/t/failed-build-slicer-in-windows10-with-visual-studio-2017-qt-5-10-1/19718/7 "2021-09-21T06:10:08Z")

</div>

This message is C:\D\S4R\Slicer-build\Slicer.sln.  
and I tried upload SlicerTargets.cmake but so long texts…  
1\>------ 빌드 시작: 프로젝트: CTKResEdit, 구성: Release x64 ------  
2\>------ 빌드 시작: 프로젝트: LZMA, 구성: Release x64 ------  
3\>------ 빌드 시작: 프로젝트: OpenSSL, 구성: Release x64 ------  
4\>------ 빌드 시작: 프로젝트: bzip2, 구성: Release x64 ------  
5\>------ 빌드 시작: 프로젝트: zlib, 구성: Release x64 ------  
6\>------ 빌드 시작: 프로젝트: python-source, 구성: Release x64 ------  
7\>------ 빌드 시작: 프로젝트: sqlite, 구성: Release x64 ------  
8\>------ 빌드 시작: 프로젝트: tbb, 구성: Release x64 ------  
9\>------ 빌드 시작: 프로젝트: Swig, 구성: Release x64 ------  
10\>------ 빌드 시작: 프로젝트: SimpleITK-download, 구성: Release x64 ------  
11\>------ 빌드 시작: 프로젝트: SimpleFilters, 구성: Release x64 ------  
12\>------ 빌드 시작: 프로젝트: CompareVolumes, 구성: Release x64 ------  
13\>------ 빌드 시작: 프로젝트: jqPlot, 구성: Release x64 ------  
2\>Performing update step for ‘LZMA’  
4\>Performing update step for ‘bzip2’  
14\>------ 빌드 시작: 프로젝트: CTKAPPLAUNCHER, 구성: Release x64 ------  
15\>------ 빌드 시작: 프로젝트: BRAINSTools, 구성: Release x64 ------  
16\>------ 빌드 시작: 프로젝트: CTKAppLauncherLib, 구성: Release x64 ------  
5\>Performing update step for ‘zlib’  
11\>Performing update step for ‘SimpleFilters’  
12\>Performing update step for ‘CompareVolumes’  
7\>Performing update step for ‘sqlite’  
17\>------ 빌드 시작: 프로젝트: DataStore, 구성: Release x64 ------  
18\>------ 빌드 시작: 프로젝트: JsonCpp, 구성: Release x64 ------  
19\>------ 빌드 시작: 프로젝트: LandmarkRegistration, 구성: Release x64 ------  
20\>------ 빌드 시작: 프로젝트: SurfaceToolbox, 구성: Release x64 ------  
15\>Performing update step for ‘BRAINSTools’  
10\>Performing update step for ‘SimpleITK-download’  
16\>Performing update step for ‘CTKAppLauncherLib’  
18\>Performing update step for ‘JsonCpp’  
21\>------ 빌드 시작: 프로젝트: qRestAPI, 구성: Release x64 ------  
22\>------ 빌드 시작: 프로젝트: DCMTK, 구성: Release x64 ------  
23\>------ 빌드 시작: 프로젝트: curl, 구성: Release x64 ------  
24\>------ 빌드 시작: 프로젝트: LibArchive, 구성: Release x64 ------  
25\>------ 빌드 시작: 프로젝트: MultiVolumeExplorer, 구성: Release x64 ------  
26\>------ 빌드 시작: 프로젝트: MultiVolumeImporter, 구성: Release x64 ------  
27\>------ 빌드 시작: 프로젝트: vtkAddon, 구성: Release x64 ------  
28\>------ 빌드 시작: 프로젝트: RapidJSON, 구성: Release x64 ------  
17\>Performing update step for ‘DataStore’  
20\>Performing update step for ‘SurfaceToolbox’  
21\>Performing update step for ‘qRestAPI’  
25\>Performing update step for ‘MultiVolumeExplorer’  
26\>Performing update step for ‘MultiVolumeImporter’  
27\>Performing update step for ‘vtkAddon’  
28\>Performing update step for ‘RapidJSON’  
29\>------ 빌드 시작: 프로젝트: python, 구성: Release x64 ------  
19\>Performing update step for ‘LandmarkRegistration’  
24\>Creating directories for ‘LibArchive’  
22\>Performing update step for ‘DCMTK’  
23\>Performing update step for ‘curl’  
29\>Performing update step for ‘python’  
24\>Building Custom Rule C:/D/S4/CMakeLists.txt  
30\>------ 빌드 시작: 프로젝트: python-ensurepip, 구성: Release x64 ------  
31\>------ 빌드 시작: 프로젝트: VTK, 구성: Release x64 ------  
24\>Performing download step (git clone) for ‘LibArchive’  
24\>-- Avoiding repeated git clone, stamp file is up to date: ‘C:/D/S4R/LibArchive-prefix/src/LibArchive-stamp/LibArchive-gitclone-lastrun.txt’  
24\>Performing update step for ‘LibArchive’  
31\>Performing update step for ‘VTK’  
32\>------ 빌드 시작: 프로젝트: python-setuptools, 구성: Release x64 ------  
24\>No patch step for ‘LibArchive’  
24\>Generate version-LibArchive.txt and license-LibArchive.txt  
33\>------ 빌드 시작: 프로젝트: ITK, 구성: Release x64 ------  
34\>------ 빌드 시작: 프로젝트: teem, 구성: Release x64 ------  
35\>------ 빌드 시작: 프로젝트: python-pip, 구성: Release x64 ------  
24\>Performing configure step for ‘LibArchive’  
24\>loading initial cache file C:/D/S4R/LibArchive-prefix/tmp/LibArchive-cache-Release.cmake  
34\>Performing update step for ‘teem’  
33\>Performing update step for ‘ITK’  
24\>-- Selecting Windows SDK version 10.0.19041.0 to target Windows 10.0.19042.  
36\>------ 빌드 시작: 프로젝트: python-numpy, 구성: Release x64 ------  
37\>------ 빌드 시작: 프로젝트: python-requests-requirements, 구성: Release x64 ------  
38\>------ 빌드 시작: 프로젝트: python-wheel, 구성: Release x64 ------  
39\>------ 빌드 시작: 프로젝트: python-extension-manager-requirements, 구성: Release x64 ------  
24\>-- Could NOT find LIBB2 (missing: LIBB2\_LIBRARY LIBB2\_INCLUDE\_DIR)  
24\>-- Could NOT find LZ4 (missing: LZ4\_LIBRARY LZ4\_INCLUDE\_DIR)  
24\>-- Could NOT find ZSTD (missing: ZSTD\_LIBRARY ZSTD\_INCLUDE\_DIR)  
24\>-- Could NOT find LIBGCC (missing: LIBGCC\_LIBRARY)  
24\>-- Could NOT find PCREPOSIX (missing: PCREPOSIX\_LIBRARY PCRE\_INCLUDE\_DIR)  
24\>-- Could NOT find PCRE (missing: PCRE\_LIBRARY)  
40\>------ 빌드 시작: 프로젝트: SimpleITK, 구성: Release x64 ------  
41\>------ 빌드 시작: 프로젝트: SlicerExecutionModel, 구성: Release x64 ------  
42\>------ 빌드 시작: 프로젝트: CTK, 구성: Release x64 ------  
24\>-- Configuring done  
43\>------ 빌드 시작: 프로젝트: python-dicom-requirements, 구성: Release x64 ------  
44\>------ 빌드 시작: 프로젝트: python-extension-manager-ssl-requirements, 구성: Release x64 ------  
45\>------ 빌드 시작: 프로젝트: python-pythonqt-requirements, 구성: Release x64 ------  
46\>------ 빌드 시작: 프로젝트: python-scipy, 구성: Release x64 ------  
24\>-- Generating done  
24\>-- Build files have been written to: C:/D/S4R/LibArchive-build  
24\>Performing build step for ‘LibArchive’  
41\>Performing update step for ‘SlicerExecutionModel’  
42\>Performing update step for ‘CTK’  
24\>.NET Framework용 Microsoft (R) Build Engine 버전 15.9.21+g9802d43bc3  
24\>Copyright (C) Microsoft Corporation. All rights reserved.  
24\>  
24\> archive\_read\_support\_format\_rar5.c  
24\>C:\D\S4R\LibArchive\libarchive\archive\_read\_support\_format\_rar5.c : error C2220: 경고가 오류로 처리되어 생성된 ‘object’ 파일이 없습니다. [C:\D\S4R\LibArchive-build\libarchive\archive.vcxproj]  
24\>C:\D\S4R\LibArchive\libarchive\archive\_read\_support\_format\_rar5.c : warning C4819: 현재 코드 페이지(949)에서 표시할 수 없는 문자가 파일에 들어 있습니다. 데이터가 손실되지 않게 하려면 해당 파일을 유니코드 형식으로 저장하십시오. [C:\D\S4R\LibArchive-build\libarchive\archive.vcxproj]  
24\> archive\_read\_support\_format\_rar5.c  
24\>C:\D\S4R\LibArchive\libarchive\archive\_read\_support\_format\_rar5.c : error C2220: 경고가 오류로 처리되어 생성된 ‘object’ 파일이 없습니다. [C:\D\S4R\LibArchive-build\libarchive\archive\_static.vcxproj]  
24\>C:\D\S4R\LibArchive\libarchive\archive\_read\_support\_format\_rar5.c : warning C4819: 현재 코드 페이지(949)에서 표시할 수 없는 문자가 파일에 들어 있습니다. 데이터가 손실되지 않게 하려면 해당 파일을 유니코드 형식으로 저장하십시오. [C:\D\S4R\LibArchive-build\libarchive\archive\_static.vcxproj]  
24\>“LibArchive.vcxproj” 프로젝트를 빌드했습니다. - 실패  
47\>------ 빌드 시작: 프로젝트: Slicer, 구성: Release x64 ------  
47\>Creating directories for ‘Slicer’  
47\>Building Custom Rule C:/D/S4/CMakeLists.txt  
47\>No download step for ‘Slicer’  
47\>No update step for ‘Slicer’  
47\>No patch step for ‘Slicer’  
47\>Performing configure step for ‘Slicer’  
47\>loading initial cache file C:/D/S4R/Slicer-prefix/tmp/Slicer-cache-Release.cmake  
47\>-- Setting C++ standard  
47\>-- Setting C++ standard - C++11  
47\>-- Selecting Windows SDK version 10.0.19041.0 to target Windows 10.0.19042.  
47\>-- Could NOT find Subversion (missing: Subversion\_SVN\_EXECUTABLE)  
47\>-- Configuring Slicer organization domain [[www.na-mic.org](http://www.na-mic.org)]  
47\>-- Configuring Slicer organization name [NA-MIC]  
47\>-- Configuring Slicer default home module [Welcome]  
47\>-- Configuring Slicer default favorite modules [Data, Volumes, Models, Transforms, Markups, SegmentEditor]  
47\>-- Configuring Slicer text of disclaimer at startup [Thank you for using %1!  
  
This software is not intended for clinical use.]  
47\>-- Configuring Slicer requires admin account [OFF]  
47\>-- Configuring Slicer install root [$LOCALAPPDATA/NA-MIC]  
47\>-- Configuring Slicer release type [Experimental]  
47\>CMake Warning (dev) at CMake/SlicerMacroExtractRepositoryInfo.cmake:94 (message):  
47\> Skipping repository info extraction: directory [C:/D/S4] is not a GIT or  
47\> SVN checkout  
47\>Call Stack (most recent call first):  
47\> CMake/SlicerVersion.cmake:55 (SlicerMacroExtractRepositoryInfo)  
47\> CMakeLists.txt:182 (include)  
47\>This warning is for project developers. Use -Wno-dev to suppress it.  
47\>  
47\>-- Configuring Slicer version [4.11.20200930-0000-00-00]  
47\>-- Configuring Slicer revision [3037]  
47\>CMake Warning (dev) at CMake/SlicerMacroExtractRepositoryInfo.cmake:94 (message):  
47\> Skipping repository info extraction: directory [C:/D/S4] is not a GIT or  
47\> SVN checkout  
47\>Call Stack (most recent call first):  
47\> CMake/SlicerVersion.cmake:99 (SlicerMacroExtractRepositoryInfo)  
47\> CMakeLists.txt:182 (include)  
47\>This warning is for project developers. Use -Wno-dev to suppress it.  
47\>  
47\>-- Configuring VTK  
47\>-- Slicer\_VTK\_RENDERING\_BACKEND is OpenGL2  
47\>-- Slicer\_VTK\_SMP\_IMPLEMENTATION\_TYPE is TBB  
47\>-- Slicer\_VTK\_VERSION\_MAJOR is 8  
47\>-- Configuring Slicer with Qt 5.10.1 (using modules: Core, Widgets, Multimedia, Network, OpenGL, PrintSupport, UiTools, Xml, XmlPatterns, Svg, Sql, WebEngine, WebEngineWidgets, WebChannel, Script, Test, )  
47\>-- Setting QT\_PLUGINS\_DIR: C:/Qt/Qt5.10.1/5.10.1/msvc2017\_64/plugins  
47\>-- Setting QT\_BINARY\_DIR: C:/Qt/Qt5.10.1/5.10.1/msvc2017\_64/bin  
47\>-- Setting ExternalData\_OBJECT\_STORES to ‘C:/D/S4R/Slicer-build/ExternalData/Objects’  
47\>-- Configuring Slicer for [win-amd64]  
47\>-- Trying to find DCMTK expecting DCMTKConfig.cmake  
47\>-- Trying to find DCMTK expecting DCMTKConfig.cmake - ok  
47\>-- Configuring Slicer with python 3.6  
47\>-- Configuring library: ITKFactoryRegistration  
47\>-- Configuring library: vtkAddon [vtkAddon\_SOURCE\_DIR: C:/D/S4R/vtkAddon]  
47\>-- Configuring library: vtkTeem  
47\>-- Configuring library: vtkITK  
47\>-- Configuring library: vtkSegmentationCore  
47\>-- Configuring library: MRML/Core  
47\>-- Configuring library: MRML/CLI  
47\>-- Configuring library: RemoteIO  
47\>-- Configuring library: MRML/Logic  
47\>-- Configuring library: MRML/DisplayableManager  
47\>-- Configuring library: MRML/IDImageIO  
47\>-- Configuring library: MRML/Widgets  
47\>-- Looking for decorator header qMRMLWidgetsPythonQtDecorators.h  
47\>-- Looking for decorator header qMRMLWidgetsPythonQtDecorators.h - Not found  
47\>-- Trying to find DCMTK expecting DCMTKConfig.cmake  
47\>-- Trying to find DCMTK expecting DCMTKConfig.cmake - ok  
47\>-- Configuring Slicer Qt base library: qSlicerBaseQTCore  
47\>-- Looking for decorator header qSlicerBaseQTCorePythonQtDecorators.h  
47\>-- Looking for decorator header qSlicerBaseQTCorePythonQtDecorators.h - Found  
47\>-- Configuring Slicer Qt base library: qSlicerBaseQTGUI  
47\>-- Looking for decorator header qSlicerBaseQTGUIPythonQtDecorators.h  
47\>-- Looking for decorator header qSlicerBaseQTGUIPythonQtDecorators.h - Found  
47\>-- Configuring Slicer Qt base library: qSlicerBaseQTCLI  
47\>-- Looking for decorator header qSlicerBaseQTCLIPythonQtDecorators.h  
47\>-- Looking for decorator header qSlicerBaseQTCLIPythonQtDecorators.h - Not found  
47\>-- Configuring SEM CLI module: CLIModule4Test  
47\>-- Configuring Slicer Qt base library: qSlicerModulesCore  
47\>-- Configuring Slicer Qt base library: qSlicerBaseQTApp  
47\>-- Looking for decorator header qSlicerBaseQTAppPythonQtDecorators.h  
47\>-- Looking for decorator header qSlicerBaseQTAppPythonQtDecorators.h - Found  
47\>-- Configuring Loadable module: Cameras [qSlicerCamerasModuleExport.h]  
47\>-- Looking for decorator header qSlicerUnitsModuleWidgetsPythonQtDecorators.h  
47\>-- Looking for decorator header qSlicerUnitsModuleWidgetsPythonQtDecorators.h - Not found  
47\>-- Configuring Loadable module: Units [qSlicerUnitsModuleExport.h]  
47\>-- RapidJSON found. Headers: ./include/Slicer-4.11  
47\>-- Looking for decorator header qSlicerTerminologiesModuleWidgetsPythonQtDecorators.h  
47\>-- Looking for decorator header qSlicerTerminologiesModuleWidgetsPythonQtDecorators.h - Not found  
47\>-- Configuring Loadable module: Terminologies [qSlicerTerminologiesModuleExport.h]  
47\>-- Configuring Loadable module: Colors [qSlicerColorsModuleExport.h]  
47\>-- Configuring Scripted module: ColorsScalarBarSelfTest  
47\>-- Looking for decorator header qSlicerSubjectHierarchyModuleWidgetsPythonQtDecorators.h  
47\>-- Looking for decorator header qSlicerSubjectHierarchyModuleWidgetsPythonQtDecorators.h - Found  
47\>-- Configuring Loadable module: SubjectHierarchy [qSlicerSubjectHierarchyModuleExport.h]  
47\>-- Configuring Scripted module: SubjectHierarchyCorePluginsSelfTest  
47\>-- Configuring Scripted module: SubjectHierarchyGenericSelfTest  
47\>-- Looking for decorator header qSlicerAnnotationsModuleWidgetsPythonQtDecorators.h  
47\>-- Looking for decorator header qSlicerAnnotationsModuleWidgetsPythonQtDecorators.h - Not found  
47\>-- Configuring Loadable module: Annotations [qSlicerAnnotationsModuleExport.h]  
47\>-- RapidJSON found. Headers: ./include/Slicer-4.11  
47\>-- Looking for decorator header qSlicerMarkupsSubjectHierarchyPluginsPythonQtDecorators.h  
47\>-- Looking for decorator header qSlicerMarkupsSubjectHierarchyPluginsPythonQtDecorators.h - Not found  
47\>-- Looking for decorator header qSlicerMarkupsModuleWidgetsPythonQtDecorators.h  
47\>-- Looking for decorator header qSlicerMarkupsModuleWidgetsPythonQtDecorators.h - Not found  
47\>-- Configuring Scripted module: MarkupsWidgetsSelfTest  
47\>-- Configuring Loadable module: Markups [qSlicerMarkupsModuleExport.h]  
47\>-- Configuring Scripted module: AddManyMarkupsFiducialTest  
47\>-- Configuring Scripted module: NeurosurgicalPlanningTutorialMarkupsSelfTest  
47\>-- Configuring Scripted module: MarkupsInCompareViewersSelfTest  
47\>-- Configuring Scripted module: MarkupsInViewsSelfTest  
47\>-- Looking for decorator header qSlicerTransformsModuleWidgetsPythonQtDecorators.h  
47\>-- Looking for decorator header qSlicerTransformsModuleWidgetsPythonQtDecorators.h - Not found  
47\>-- Looking for decorator header qSlicerTransformsSubjectHierarchyPluginsPythonQtDecorators.h  
47\>-- Looking for decorator header qSlicerTransformsSubjectHierarchyPluginsPythonQtDecorators.h - Not found  
47\>-- Configuring Loadable module: Transforms [qSlicerTransformsModuleExport.h]  
47\>-- Configuring Loadable module: Data [qSlicerDataModuleExport.h]  
47\>-- Configuring Loadable module: DoubleArrays [qSlicerDoubleArraysModuleExport.h]  
47\>-- Looking for decorator header qSlicerModelsSubjectHierarchyPluginsPythonQtDecorators.h  
47\>-- Looking for decorator header qSlicerModelsSubjectHierarchyPluginsPythonQtDecorators.h - Not found  
47\>-- Looking for decorator header qSlicerModelsModuleWidgetsPythonQtDecorators.h  
47\>-- Looking for decorator header qSlicerModelsModuleWidgetsPythonQtDecorators.h - Not found  
47\>-- Configuring Loadable module: Models [qSlicerModelsModuleExport.h]  
47\>-- Looking for decorator header qSlicerPlotsSubjectHierarchyPluginsPythonQtDecorators.h  
47\>-- Looking for decorator header qSlicerPlotsSubjectHierarchyPluginsPythonQtDecorators.h - Not found  
47\>-- Looking for decorator header qSlicerPlotsModuleWidgetsPythonQtDecorators.h  
47\>-- Looking for decorator header qSlicerPlotsModuleWidgetsPythonQtDecorators.h - Not found  
47\>-- Configuring Loadable module: Plots [qSlicerPlotsModuleExport.h]  
47\>-- Configuring Scripted module: PlotsSelfTest  
47\>-- Looking for decorator header qSlicerSceneViewsSubjectHierarchyPluginsPythonQtDecorators.h  
47\>-- Looking for decorator header qSlicerSceneViewsSubjectHierarchyPluginsPythonQtDecorators.h - Not found  
47\>-- Configuring Loadable module: SceneViews [qSlicerSceneViewsModuleExport.h]  
47\>-- Looking for decorator header qSlicerSegmentationsEditorEffectsPythonQtDecorators.h  
47\>-- Looking for decorator header qSlicerSegmentationsEditorEffectsPythonQtDecorators.h - Not found  
47\>-- Looking for decorator header qSlicerSegmentationsModuleWidgetsPythonQtDecorators.h  
47\>-- Looking for decorator header qSlicerSegmentationsModuleWidgetsPythonQtDecorators.h - Not found  
47\>-- Looking for decorator header qSlicerSegmentationsSubjectHierarchyPluginsPythonQtDecorators.h  
47\>-- Looking for decorator header qSlicerSegmentationsSubjectHierarchyPluginsPythonQtDecorators.h - Not found  
47\>-- Configuring Loadable module: Segmentations [qSlicerSegmentationsModuleExport.h]  
47\>-- Looking for decorator header qSlicerSequencesModuleWidgetsPythonQtDecorators.h  
47\>-- Looking for decorator header qSlicerSequencesModuleWidgetsPythonQtDecorators.h - Not found  
47\>-- Configuring Loadable module: Sequences [qSlicerSequencesModuleExport.h]  
47\>-- Configuring Loadable module: Welcome [qSlicerWelcomeModuleExport.h]  
47\>-- Looking for decorator header qSlicerTablesSubjectHierarchyPluginsPythonQtDecorators.h  
47\>-- Looking for decorator header qSlicerTablesSubjectHierarchyPluginsPythonQtDecorators.h - Not found  
47\>-- Looking for decorator header qSlicerTablesModuleWidgetsPythonQtDecorators.h  
47\>-- Looking for decorator header qSlicerTablesModuleWidgetsPythonQtDecorators.h - Not found  
47\>-- Configuring Loadable module: Tables [qSlicerTablesModuleExport.h]  
47\>-- Configuring Scripted module: TablesSelfTest  
47\>-- Looking for decorator header qSlicerTextsModuleWidgetsPythonQtDecorators.h  
47\>-- Looking for decorator header qSlicerTextsModuleWidgetsPythonQtDecorators.h - Not found  
47\>-- Looking for decorator header qSlicerTextsSubjectHierarchyPluginsPythonQtDecorators.h  
47\>-- Looking for decorator header qSlicerTextsSubjectHierarchyPluginsPythonQtDecorators.h - Not found  
47\>-- Configuring Loadable module: Texts [qSlicerTextsModuleExport.h]  
47\>-- Configuring Loadable module: Reformat [qSlicerReformatModuleExport.h]  
47\>-- Configuring Loadable module: ViewControllers [qSlicerViewControllersModuleExport.h]  
47\>-- Looking for decorator header qSlicerVolumesSubjectHierarchyPluginsPythonQtDecorators.h  
47\>-- Looking for decorator header qSlicerVolumesSubjectHierarchyPluginsPythonQtDecorators.h - Not found  
47\>-- Looking for decorator header qSlicerVolumesModuleWidgetsPythonQtDecorators.h  
47\>-- Looking for decorator header qSlicerVolumesModuleWidgetsPythonQtDecorators.h - Not found  
47\>-- Configuring Loadable module: Volumes [qSlicerVolumesModuleExport.h]  
47\>-- Looking for decorator header qSlicerVolumeRenderingModuleWidgetsPythonQtDecorators.h  
47\>-- Looking for decorator header qSlicerVolumeRenderingModuleWidgetsPythonQtDecorators.h - Not found  
47\>-- Looking for decorator header qSlicerVolumeRenderingSubjectHierarchyPluginsPythonQtDecorators.h  
47\>-- Looking for decorator header qSlicerVolumeRenderingSubjectHierarchyPluginsPythonQtDecorators.h - Not found  
47\>-- Configuring Loadable module: VolumeRendering [qSlicerVolumeRenderingModuleExport.h]  
47\>VolumeRendering CXX tests: TEMP var: C:/D/S4R/Slicer-build/Testing/Temporary  
47\>-- Configuring Loadable module: CropVolume [qSlicerCropVolumeModuleExport.h]  
47\>-- Configuring Scripted module: CropVolumeSelfTest  
47\>-- Configuring Scripted module: CropVolumeSequence  
47\>-- Configuring Scripted module: DataProbe  
47\>-- Configuring Scripted module: Editor  
47\>-- Configuring Scripted module: EditorLib  
47\>-- Configuring Scripted module: LabelStatistics  
47\>-- Configuring Scripted module: PerformanceTests  
47\>-- Configuring Scripted module: SampleData  
47\>-- Configuring Scripted module: ScreenCapture  
47\>-- Configuring Scripted module: SegmentEditor  
47\>-- Configuring Scripted module: SegmentStatistics  
47\>-- Configuring Scripted module: SelfTests  
47\>-- Configuring Scripted module: VectorToScalarVolume  
47\>-- Configuring Scripted module: DMRIInstall  
47\>-- Configuring Scripted module: ExtensionWizard  
47\>-- Configuring Scripted module: Endoscopy  
47\>-- Configuring Scripted module: DICOM  
47\>-- Looking for decorator header qSlicerDICOMLibModuleWidgetsPythonQtDecorators.h  
47\>-- Looking for decorator header qSlicerDICOMLibModuleWidgetsPythonQtDecorators.h - Not found  
47\>-- Looking for decorator header qSlicerDICOMLibSubjectHierarchyPluginsPythonQtDecorators.h  
47\>-- Looking for decorator header qSlicerDICOMLibSubjectHierarchyPluginsPythonQtDecorators.h - Not found  
47\>-- Configuring Scripted module: DICOMLib  
47\>-- Configuring Scripted module: DICOMPlugins  
47\>-- Configuring Scripted module: DICOMPatcher  
47\>-- Configuring SEM CLI module: ACPCTransform  
47\>-- Configuring SEM CLI module: AddScalarVolumes  
47\>-- Configuring SEM CLI module: CastScalarVolume  
47\>-- Configuring SEM CLI module: CheckerBoardFilter  
47\>-- Configuring SEM CLI module: CurvatureAnisotropicDiffusion  
47\>-- Configuring SEM CLI module: ExecutionModelTour  
47\>-- Configuring SEM CLI module: ExtractSkeleton  
47\>-- Configuring SEM CLI module: GaussianBlurImageFilter  
47\>-- Configuring SEM CLI module: GradientAnisotropicDiffusion  
47\>-- Configuring SEM CLI module: GrayscaleFillHoleImageFilter  
47\>-- Configuring SEM CLI module: GrayscaleGrindPeakImageFilter  
47\>-- Configuring SEM CLI module: GrayscaleModelMaker  
47\>-- Configuring SEM CLI module: HistogramMatching  
47\>-- Configuring SEM CLI module: ImageLabelCombine  
47\>-- Configuring SEM CLI module: LabelMapSmoothing  
47\>-- Configuring SEM CLI module: MaskScalarVolume  
47\>-- Configuring SEM CLI module: MedianImageFilter  
47\>-- Configuring SEM CLI module: MergeModels  
47\>-- Configuring SEM CLI module: ModelMaker  
47\>-- Configuring SEM CLI module: ModelToLabelMap  
47\>-- Configuring SEM CLI module: MultiplyScalarVolumes  
47\>-- Configuring SEM CLI module: N4ITKBiasFieldCorrection  
47\>-- Configuring SEM CLI module: OrientScalarVolume  
47\>-- Configuring SEM CLI module: ProbeVolumeWithModel  
47\>-- Configuring SEM CLI module: ResampleDTIVolume  
47\>-- Configuring SEM CLI module: ResampleScalarVectorDWIVolume  
47\>-- Configuring SEM CLI module: RobustStatisticsSegmenter  
47\>-- Configuring SEM CLI module: SimpleRegionGrowingSegmentation  
47\>-- Configuring SEM CLI module: SubtractScalarVolumes  
47\>-- Configuring SEM CLI module: ThresholdScalarVolume  
47\>-- Configuring SEM CLI module: VotingBinaryHoleFillingImageFilter  
47\>-- Configuring SEM CLI module: CLIROITest  
47\>-- Configuring SEM CLI module: CreateDICOMSeries  
47\>-- Trying to find DCMTK expecting DCMTKConfig.cmake  
47\>-- Trying to find DCMTK expecting DCMTKConfig.cmake - ok  
47\>-- Configuring SEM CLI module: PETStandardUptakeValueComputation  
47\>-- Configuring SEM CLI module: ExpertAutomatedRegistration  
47\>-- Configuring SEM CLI module: FiducialRegistration  
47\>-- Configuring SEM CLI module: ResampleScalarVolume  
47\>-- Configuring SEM CLI module: DiffusionTensorTest  
47\>-- Configuring SEM CLI module: TestGridTransformRegistration  
47\>-- --------------------------------------------------  
47\>-- Configuring Slicer application library: qSlicerApp  
47\>-- --------------------------------------------------  
47\>-- Setting Slicer DESCRIPTION\_SUMMARY to ‘Medical Visualization and Processing Environment for Research’  
47\>-- Setting Slicer DESCRIPTION\_FILE to ‘C:/D/S4/README.txt’  
47\>-- --------------------------------------------------  
47\>-- Configuring Slicer application: SlicerApp  
47\>-- --------------------------------------------------  
47\>-- Setting Slicer APPLICATION\_NAME to ‘Slicer’  
47\>-- Setting Slicer LAUNCHER\_SPLASHSCREEN\_FILE to ‘C:/D/S4/Applications/SlicerApp/Resources/Images/Slicer-SplashScreen.png’  
47\>-- Setting Slicer APPLE\_ICON\_FILE to ‘C:/D/S4/Applications/SlicerApp/Resources/Slicer.icns’  
47\>-- Setting Slicer WIN\_ICON\_FILE to ‘C:/D/S4/Applications/SlicerApp/Resources/Slicer.ico’  
47\>-- Setting Slicer LICENSE\_FILE to ‘C:/D/S4/License.txt’  
47\>-- Setting Slicer executable name to ‘SlicerApp-real.exe’  
47\>-- Setting Slicer EXECUTABLE to ‘C:/D/S4R/Slicer-build/bin/SlicerApp-real.exe’  
47\>-- Enabling Slicer build tree launcher option: --VisualStudio  
47\>-- Enabling Slicer build tree launcher option: --VisualStudioProject  
47\>-- Enabling Slicer build tree launcher option: --cmd  
47\>-- Enabling Slicer install tree launcher option: --cmd  
47\>-- --------------------------------------------------  
47\>-- Configuring remote module: MultiVolumeExplorer  
47\>-- Configuring Loadable module: MultiVolumeExplorer [qSlicerMultiVolumeExplorerModuleExport.h]  
47\>-- --------------------------------------------------  
47\>-- Configuring remote module: MultiVolumeImporter  
47\>-- --------------------------------------------------  
47\>-- Configuring remote module: SimpleFilters  
47\>-- Checking EXTENSION\_NAME variable  
47\>-- Checking EXTENSION\_NAME variable - NOTDEFINED  
47\>-- Checking MODULE\_NAME variable  
47\>-- Checking MODULE\_NAME variable - NOTDEFINED  
47\>-- Checking PROJECT\_NAME variable  
47\>-- Checking PROJECT\_NAME variable - SimpleFilters  
47\>-- Setting EXTENSION\_NAME …: SimpleFilters  
47\>-- Configuring Scripted module: SimpleFilters  
47\>-- Skipping extension packaging: SimpleFilters - Slicer\_SOURCE\_DIR is defined.  
47\>-- --------------------------------------------------  
47\>-- Configuring remote module: BRAINSTools  
47\>CMake Warning at C:/D/S4R/BRAINSTools/Version.cmake:29 (message):  
47\> VERSION\_MINOR from project not match git tag version: “2” EQUAL “0”  
47\>Call Stack (most recent call first):  
47\> C:/D/S4R/BRAINSTools/CMakeLists.txt:61 (include)  
47\>  
47\>  
47\>-- BUILD\_FOR\_DASHBOARD: OFF  
47\>-- BRAINSTools\_BUILD\_DICOM\_SUPPORT: ON  
47\>-- BRAINSTools\_VERSION\_MAJOR 5  
47\>-- BRAINSTools\_VERSION\_MINOR 2  
47\>-- BRAINSTools\_VERSION\_PATCH 0  
47\>-- BRAINSTools\_VERSION\_TWEAK  
47\>-- BRAINSTools\_VERSION\_RC  
47\>-- BRAINSTools\_VERSION\_HASH de71a  
47\>-- BRAINSTools\_VERSION\_POST  
47\>-- BRAINSTools\_VERSION\_DEV 379  
47\>-- Building BRAINSTools version “5.2.0…dev379-gde71a”  
47\>-- Configuring SEM CLI module: BRAINSFit  
47\>-- Configuring SEM CLI module: PerformMetricTest  
47\>-- Configuring SEM CLI module: BRAINSResample  
47\>-- Configuring SEM CLI module: BRAINSResize  
47\>-- Configuring SEM CLI module: BRAINSROIAuto  
47\>-- Configuring SEM CLI module: DWIConvert  
47\>-- Configuring SEM CLI module: BRAINSLabelStats  
47\>-- Configuring SEM CLI module: BRAINSDWICleanup  
47\>-- Configuring SEM CLI module: BRAINSTransformConvert  
47\>-- Configuring SEM CLI module: BRAINSStripRotation  
47\>-- --------------------------------------------------  
47\>-- Configuring remote module: DataStore  
47\>-- Checking EXTENSION\_NAME variable  
47\>-- Checking EXTENSION\_NAME variable - NOTDEFINED  
47\>-- Checking MODULE\_NAME variable  
47\>-- Checking MODULE\_NAME variable - NOTDEFINED  
47\>-- Checking PROJECT\_NAME variable  
47\>-- Checking PROJECT\_NAME variable - DataStore  
47\>-- Setting EXTENSION\_NAME …: DataStore  
47\>-- Looking for decorator header qSlicerDataStoreModuleWidgetsPythonQtDecorators.h  
47\>-- Looking for decorator header qSlicerDataStoreModuleWidgetsPythonQtDecorators.h - Not found  
47\>-- Configuring Loadable module: DataStore [qSlicerDataStoreModuleExport.h]  
47\>-- Skipping extension packaging: DataStore - Slicer\_SOURCE\_DIR is defined.  
47\>-- --------------------------------------------------  
47\>-- Configuring remote module: CompareVolumes  
47\>-- Configuring Scripted module: CompareVolumes  
47\>-- --------------------------------------------------  
47\>-- Configuring remote module: LandmarkRegistration  
47\>-- Configuring Scripted module: LandmarkRegistration  
47\>-- --------------------------------------------------  
47\>-- Configuring remote module: SurfaceToolbox  
47\>-- Checking EXTENSION\_NAME variable  
47\>-- Checking EXTENSION\_NAME variable - NOTDEFINED  
47\>-- Checking MODULE\_NAME variable  
47\>-- Checking MODULE\_NAME variable - NOTDEFINED  
47\>-- Checking PROJECT\_NAME variable  
47\>-- Checking PROJECT\_NAME variable - SurfaceToolbox  
47\>-- Setting EXTENSION\_NAME …: SurfaceToolbox  
47\>-- Configuring SEM CLI module: BordersOut  
47\>-- Configuring SEM CLI module: Cleaner  
47\>-- Configuring SEM CLI module: Connectivity  
47\>-- Configuring SEM CLI module: Decimation  
47\>-- Configuring SEM CLI module: FillHoles  
47\>-- Configuring SEM CLI module: MC2Origin  
47\>-- Configuring SEM CLI module: Mirror  
47\>-- Configuring SEM CLI module: Normals  
47\>-- Configuring SEM CLI module: relaxPolygons  
47\>-- Configuring SEM CLI module: Smoothing  
47\>-- Configuring Scripted module: SurfaceToolbox  
47\>-- Configuring SEM CLI module: scaleMesh  
47\>-- Configuring SEM CLI module: translateMesh  
47\>-- Looking for decorator header qSlicerDynamicModelerSubjectHierarchyPluginsPythonQtDecorators.h  
47\>-- Looking for decorator header qSlicerDynamicModelerSubjectHierarchyPluginsPythonQtDecorators.h - Not found  
47\>-- Configuring Loadable module: DynamicModeler [qSlicerDynamicModelerModuleExport.h]  
47\>-- Skipping extension packaging: SurfaceToolbox - Slicer\_SOURCE\_DIR is defined.  
47\>CMake Warning at Utilities/Scripts/SlicerWizard/doc/CMakeLists.txt:41 (message):  
47\>CUSTOMBUILD : warning : sphinx-build not found: Python documentation will not be created  
47\>  
47\>  
47\>-- Setting ‘CTEST\_MODEL’ variable with default value ‘Experimental’  
47\>-- Setting ‘MIDAS\_PACKAGE\_URL’ variable with default value ‘[http://slicer.kitware.com/midas3](http://slicer.kitware.com/midas3)’  
47\>-- Setting ‘MIDAS\_PACKAGE\_EMAIL’ variable with default value ‘OBFUSCATED’  
47\>-- Setting ‘MIDAS\_PACKAGE\_API\_KEY’ variable with default value ‘OBFUSCATED’  
47\>CMake Warning (dev) at CMake/SlicerMacroExtractRepositoryInfo.cmake:94 (message):  
47\> Skipping repository info extraction: directory [C:/D/S4] is not a GIT or  
47\> SVN checkout  
47\>Call Stack (most recent call first):  
47\> CMake/SlicerPackageAndUploadTarget.cmake:100 (SlicerMacroExtractRepositoryInfo)  
47\> CMake/LastConfigureStep/CMakeLists.txt:41 (include)  
47\>This warning is for project developers. Use -Wno-dev to suppress it.  
47\>  
47\>-- Trying to find DCMTK expecting DCMTKConfig.cmake  
47\>-- Trying to find DCMTK expecting DCMTKConfig.cmake - ok  
47\>-- Setting CPACK\_PACKAGE\_NAME to ‘Slicer’  
47\>-- Setting CPACK\_PACKAGE\_VENDOR to ‘NA-MIC’  
47\>-- Setting CPACK\_PACKAGE\_VERSION\_MAJOR to ‘4’  
47\>-- Setting CPACK\_PACKAGE\_VERSION\_MINOR to ‘11’  
47\>-- Setting CPACK\_PACKAGE\_VERSION\_PATCH to ‘20200930’  
47\>-- Setting CPACK\_PACKAGE\_VERSION to ‘4.11.20200930-0000-00-00’  
47\>-- Setting CPACK\_PACKAGE\_INSTALL\_DIRECTORY to ‘Slicer 4.11.20200930-0000-00-00’  
47\>-- Setting CPACK\_PACKAGE\_DESCRIPTION\_FILE to ‘C:/D/S4/README.txt’  
47\>-- Setting CPACK\_RESOURCE\_FILE\_LICENSE to ‘C:/D/S4/License.txt’  
47\>-- Setting CPACK\_PACKAGE\_DESCRIPTION\_SUMMARY to ‘Medical Visualization and Processing Environment for Research’  
47\>-- Setting CPACK\_NSIS\_INSTALL\_SUBDIRECTORY to ‘’  
47\>-- Setting CPACK\_NSIS\_PACKAGE\_NAME to ‘Slicer 4.11.20200930-0000-00-00’  
47\>-- Setting CPACK\_PACKAGE\_INSTALL\_REGISTRY\_KEY to ‘Slicer 4.11.20200930-0000-00-00 (Win64)’  
47\>-- Setting CPACK\_NSIS\_INSTALL\_ROOT to ‘$LOCALAPPDATA\NA-MIC’  
47\>-- Setting CPACK\_PACKAGE\_EXECUTABLES to ‘…\Slicer;Slicer 4.11.20200930-0000-00-00’  
47\>-- Configuring done  
47\>-- Generating done  
47\>-- Build files have been written to: C:/D/S4R/Slicer-build  
47\>Performing build step for ‘Slicer’  
47\>.NET Framework용 Microsoft (R) Build Engine 버전 15.9.21+g9802d43bc3  
47\>Copyright (C) Microsoft Corporation. All rights reserved.  
47\>  
47\> ITKFactoryRegistration.vcxproj → C:\D\S4R\Slicer-build\bin\Release\ITKFactoryRegistration.dll  
47\> Configuring vtkSlicerVersionConfigure.h  
47\> – Configuring Slicer release type [Experimental]  
47\> CMake Warning (dev) at C:/D/S4/CMake/SlicerMacroExtractRepositoryInfo.cmake:94 (message):  
47\> Skipping repository info extraction: directory [C:/D/S4] is not a GIT or  
47\> SVN checkout  
47\> Call Stack (most recent call first):  
47\> C:/D/S4/CMake/SlicerVersion.cmake:55 (SlicerMacroExtractRepositoryInfo)  
47\> C:/D/S4/CMake/SlicerConfigureVersionHeaderTarget.cmake:131 (include)  
47\> This warning is for project developers. Use -Wno-dev to suppress it.  
47\>  
47\> – Configuring Slicer version [4.11.20200930-0000-00-00]  
47\> – Configuring Slicer revision [3037]  
47\> CMake Warning (dev) at C:/D/S4/CMake/SlicerMacroExtractRepositoryInfo.cmake:94 (message):  
47\> Skipping repository info extraction: directory [C:/D/S4] is not a GIT or  
47\> SVN checkout  
47\> Call Stack (most recent call first):  
47\> C:/D/S4/CMake/SlicerVersion.cmake:99 (SlicerMacroExtractRepositoryInfo)  
47\> C:/D/S4/CMake/SlicerConfigureVersionHeaderTarget.cmake:131 (include)  
47\> This warning is for project developers. Use -Wno-dev to suppress it.  
47\>  
47\> vtkAddon.vcxproj → C:\D\S4R\Slicer-build\bin\Release\vtkAddon.dll  
47\> vtkITK.vcxproj → C:\D\S4R\Slicer-build\bin\Release\vtkITK.dll  
47\> For vtkSegmentationCore - updating vtkSegmentationCoreHierarchy.txt  
47\> vtkOrientedImageData.cxx  
47\> vtkOrientedImageDataResample.cxx  
47\> vtkSegment.cxx  
47\> vtkSegmentation.cxx  
47\> vtkSegmentationConverter.cxx  
47\> vtkSegmentationConverterFactory.cxx  
47\> vtkSegmentationConverterRule.cxx  
47\> vtkSegmentationHistory.cxx  
47\> vtkSegmentationModifier.cxx  
47\> vtkTopologicalHierarchy.cxx  
47\> vtkBinaryLabelmapToClosedSurfaceConversionRule.cxx  
47\> vtkClosedSurfaceToBinaryLabelmapConversionRule.cxx  
47\> vtkCalculateOversamplingFactor.cxx  
47\> vtkClosedSurfaceToFractionalLabelmapConversionRule.cxx  
47\> vtkFractionalLabelmapToClosedSurfaceConversionRule.cxx  
47\> vtkPolyDataToFractionalLabelmapFilter.cxx  
47\> 코드를 생성하고 있습니다…  
47\> C:/D/S4R/Slicer-build/lib/Slicer-4.11/Release/vtkSegmentationCore.lib 라이브러리 및 C:/D/S4R/Slicer-build/lib/Slicer-4.11/Release/vtkSegmentationCore.exp 개체를 생성하고 있습니다.  
47\> vtkSegmentationCore.vcxproj → C:\D\S4R\Slicer-build\bin\Release\vtkSegmentationCore.dll  
47\> vtkTeem.vcxproj → C:\D\S4R\Slicer-build\bin\Release\vtkTeem.dll  
47\> For MRMLCore - updating MRMLCoreHierarchy.txt  
47\> vtkArchive.cxx  
47\>C:\D\S4\Libs\MRML\Core\vtkArchive.cxx(17): fatal error C1083: 포함 파일을 열 수 없습니다. ‘archive.h’: No such file or directory [C:\D\S4R\Slicer-build\Libs\MRML\Core\MRMLCore.vcxproj]  
47\> SlicerBaseCLI.vcxproj → C:\D\S4R\Slicer-build\bin\Release\SlicerBaseCLI.dll  
47\> AddScalarVolumesLib.vcxproj → C:\D\S4R\Slicer-build\lib\Slicer-4.11\cli-modules\Release\AddScalarVolumesLib.dll  
47\> AddScalarVolumes.vcxproj → C:\D\S4R\Slicer-build\lib\Slicer-4.11\cli-modules\Release\AddScalarVolumes.exe  
47\> Copying XML file ‘AddScalarVolumes.xml’ along side the executable  
47\> AddScalarVolumesTest.vcxproj → C:\D\S4R\Slicer-build\bin\Release\AddScalarVolumesTest.exe  
47\> BRAINSCommonLib.vcxproj → C:\D\S4R\Slicer-build\lib\Slicer-4.11\Release\BRAINSCommonLib.lib  
47\> BRAINSDWICleanupLib.vcxproj → C:\D\S4R\Slicer-build\lib\Slicer-4.11\cli-modules\Release\BRAINSDWICleanupLib.dll  
47\> BRAINSDWICleanup.vcxproj → C:\D\S4R\Slicer-build\lib\Slicer-4.11\cli-modules\Release\BRAINSDWICleanup.exe  
47\> Copying XML file ‘BRAINSDWICleanup.xml’ along side the executable  
47\> BRAINSFitLib.vcxproj → C:\D\S4R\Slicer-build\lib\Slicer-4.11\cli-modules\Release\BRAINSFitLib.dll  
47\> BRAINSFit.vcxproj → C:\D\S4R\Slicer-build\lib\Slicer-4.11\cli-modules\Release\BRAINSFit.exe  
47\> Copying XML file ‘BRAINSFit.xml’ along side the executable  
47\> BRAINSLabelStatsLib.vcxproj → C:\D\S4R\Slicer-build\lib\Slicer-4.11\cli-modules\Release\BRAINSLabelStatsLib.dll  
47\> BRAINSLabelStats.vcxproj → C:\D\S4R\Slicer-build\lib\Slicer-4.11\cli-modules\Release\BRAINSLabelStats.exe  
47\> Copying XML file ‘BRAINSLabelStats.xml’ along side the executable  
47\> BRAINSROIAutoLib.vcxproj → C:\D\S4R\Slicer-build\lib\Slicer-4.11\cli-modules\Release\BRAINSROIAutoLib.dll  
47\> BRAINSROIAuto.vcxproj → C:\D\S4R\Slicer-build\lib\Slicer-4.11\cli-modules\Release\BRAINSROIAuto.exe  
47\> Copying XML file ‘BRAINSROIAuto.xml’ along side the executable  
47\> BRAINSResampleLib.vcxproj → C:\D\S4R\Slicer-build\lib\Slicer-4.11\cli-modules\Release\BRAINSResampleLib.dll  
47\> BRAINSResample.vcxproj → C:\D\S4R\Slicer-build\lib\Slicer-4.11\cli-modules\Release\BRAINSResample.exe  
47\> Copying XML file ‘BRAINSResample.xml’ along side the executable  
47\> BRAINSResizeLib.vcxproj → C:\D\S4R\Slicer-build\lib\Slicer-4.11\cli-modules\Release\BRAINSResizeLib.dll  
47\> BRAINSResize.vcxproj → C:\D\S4R\Slicer-build\lib\Slicer-4.11\cli-modules\Release\BRAINSResize.exe  
47\> Copying XML file ‘BRAINSResize.xml’ along side the executable  
47\> BRAINSStripRotationLib.vcxproj → C:\D\S4R\Slicer-build\lib\Slicer-4.11\cli-modules\Release\BRAINSStripRotationLib.dll  
47\> BRAINSStripRotation.vcxproj → C:\D\S4R\Slicer-build\lib\Slicer-4.11\cli-modules\Release\BRAINSStripRotation.exe  
47\> Copying XML file ‘BRAINSStripRotation.xml’ along side the executable  
47\> BRAINSTransformConvertLib.vcxproj → C:\D\S4R\Slicer-build\lib\Slicer-4.11\cli-modules\Release\BRAINSTransformConvertLib.dll  
47\> BRAINSTransformConvert.vcxproj → C:\D\S4R\Slicer-build\lib\Slicer-4.11\cli-modules\Release\BRAINSTransformConvert.exe  
47\> Copying XML file ‘BRAINSTransformConvert.xml’ along side the executable  
47\> BordersOutLib.vcxproj → C:\D\S4R\Slicer-build\lib\Slicer-4.11\cli-modules\Release\BordersOutLib.dll  
47\> BordersOut.vcxproj → C:\D\S4R\Slicer-build\lib\Slicer-4.11\cli-modules\Release\BordersOut.exe  
47\> Copying XML file ‘BordersOut.xml’ along side the executable  
47\> CLIModule4TestLib.vcxproj → C:\D\S4R\Slicer-build\lib\Slicer-4.11\cli-modules\Release\CLIModule4TestLib.dll  
47\> SEMCommandLineLibraryWrapper.cxx  
47\> CLIModule4Test.vcxproj → C:\D\S4R\Slicer-build\lib\Slicer-4.11\cli-modules\Release\CLIModule4Test.exe  
47\> Copying XML file ‘CLIModule4Test.xml’ along side the executable  
47\> CastScalarVolumeLib.vcxproj → C:\D\S4R\Slicer-build\lib\Slicer-4.11\cli-modules\Release\CastScalarVolumeLib.dll  
47\> CastScalarVolume.vcxproj → C:\D\S4R\Slicer-build\lib\Slicer-4.11\cli-modules\Release\CastScalarVolume.exe  
47\> Copying XML file ‘CastScalarVolume.xml’ along side the executable  
47\> CastScalarVolumeTest.vcxproj → C:\D\S4R\Slicer-build\bin\Release\CastScalarVolumeTest.exe  
47\> CheckerBoardFilterLib.vcxproj → C:\D\S4R\Slicer-build\lib\Slicer-4.11\cli-modules\Release\CheckerBoardFilterLib.dll  
47\> CheckerBoardFilter.vcxproj → C:\D\S4R\Slicer-build\lib\Slicer-4.11\cli-modules\Release\CheckerBoardFilter.exe  
47\> Copying XML file ‘CheckerBoardFilter.xml’ along side the executable  
47\> CheckerBoardFilterTest.vcxproj → C:\D\S4R\Slicer-build\bin\Release\CheckerBoardFilterTest.exe  
47\> CleanerLib.vcxproj → C:\D\S4R\Slicer-build\lib\Slicer-4.11\cli-modules\Release\CleanerLib.dll  
47\> Cleaner.vcxproj → C:\D\S4R\Slicer-build\lib\Slicer-4.11\cli-modules\Release\Cleaner.exe  
47\> Copying XML file ‘Cleaner.xml’ along side the executable  
47\> ConnectivityLib.vcxproj → C:\D\S4R\Slicer-build\lib\Slicer-4.11\cli-modules\Release\ConnectivityLib.dll  
47\> Connectivity.vcxproj → C:\D\S4R\Slicer-build\lib\Slicer-4.11\cli-modules\Release\Connectivity.exe  
47\> Copying XML file ‘Connectivity.xml’ along side the executable  
47\> DWIConvertSupportLib.vcxproj → C:\D\S4R\Slicer-build\lib\Slicer-4.11\Release\DWIConvertSupportLib.lib  
47\> Convert4DImageTo3DSeries.vcxproj → C:\D\S4R\Slicer-build\bin\Release\Convert4DImageTo3DSeries.exe  
47\> CreateDICOMSeriesLib.vcxproj → C:\D\S4R\Slicer-build\lib\Slicer-4.11\cli-modules\Release\CreateDICOMSeriesLib.dll  
47\> CreateDICOMSeries.vcxproj → C:\D\S4R\Slicer-build\lib\Slicer-4.11\cli-modules\Release\CreateDICOMSeries.exe  
47\> Copying XML file ‘CreateDICOMSeries.xml’ along side the executable  
47\> CreateDICOMSeriesTest.vcxproj → C:\D\S4R\Slicer-build\bin\Release\CreateDICOMSeriesTest.exe  
47\> CurvatureAnisotropicDiffusionLib.vcxproj → C:\D\S4R\Slicer-build\lib\Slicer-4.11\cli-modules\Release\CurvatureAnisotropicDiffusionLib.dll  
47\> CurvatureAnisotropicDiffusion.vcxproj → C:\D\S4R\Slicer-build\lib\Slicer-4.11\cli-modules\Release\CurvatureAnisotropicDiffusion.exe  
47\> Copying XML file ‘CurvatureAnisotropicDiffusion.xml’ along side the executable  
47\> DWIConvertLib.vcxproj → C:\D\S4R\Slicer-build\lib\Slicer-4.11\cli-modules\Release\DWIConvertLib.lib  
47\> DWIConvert.vcxproj → C:\D\S4R\Slicer-build\lib\Slicer-4.11\cli-modules\Release\DWIConvert.exe  
47\> Copying XML file ‘DWIConvert.xml’ along side the executable  
47\> DecimationLib.vcxproj → C:\D\S4R\Slicer-build\lib\Slicer-4.11\cli-modules\Release\DecimationLib.dll  
47\> Decimation.vcxproj → C:\D\S4R\Slicer-build\lib\Slicer-4.11\cli-modules\Release\Decimation.exe  
47\> Copying XML file ‘Decimation.xml’ along side the executable  
47\> DiffusionTensorTestLib.vcxproj → C:\D\S4R\Slicer-build\lib\Slicer-4.11\cli-modules\Release\DiffusionTensorTestLib.dll  
47\> DiffusionTensorTest.vcxproj → C:\D\S4R\Slicer-build\lib\Slicer-4.11\cli-modules\Release\DiffusionTensorTest.exe  
47\> Copying XML file ‘DiffusionTensorTest.xml’ along side the executable  
47\> DiffusionTensorTestTest.vcxproj → C:\D\S4R\Slicer-build\bin\Release\DiffusionTensorTestTest.exe  
47\> For MRMLCore - updating MRMLCoreHierarchy.txt  
47\> For vtkSegmentationCore - updating vtkSegmentationCoreHierarchy.txt  
47\> ExpertAutomatedRegistrationLib.vcxproj → C:\D\S4R\Slicer-build\lib\Slicer-4.11\cli-modules\Release\ExpertAutomatedRegistrationLib.dll  
47\> ExpertAutomatedRegistration.vcxproj → C:\D\S4R\Slicer-build\lib\Slicer-4.11\cli-modules\Release\ExpertAutomatedRegistration.exe  
47\> Copying XML file ‘ExpertAutomatedRegistration.xml’ along side the executable  
47\> FiducialRegistrationLib.vcxproj → C:\D\S4R\Slicer-build\lib\Slicer-4.11\cli-modules\Release\FiducialRegistrationLib.dll  
47\> FiducialRegistration.vcxproj → C:\D\S4R\Slicer-build\lib\Slicer-4.11\cli-modules\Release\FiducialRegistration.exe  
47\> Copying XML file ‘FiducialRegistration.xml’ along side the executable  
47\> FiducialRegistrationTest.vcxproj → C:\D\S4R\Slicer-build\bin\Release\FiducialRegistrationTest.exe  
47\> FillHolesLib.vcxproj → C:\D\S4R\Slicer-build\lib\Slicer-4.11\cli-modules\Release\FillHolesLib.dll  
47\> FillHoles.vcxproj → C:\D\S4R\Slicer-build\lib\Slicer-4.11\cli-modules\Release\FillHoles.exe  
47\> Copying XML file ‘FillHoles.xml’ along side the executable  
47\> GaussianBlurImageFilterLib.vcxproj → C:\D\S4R\Slicer-build\lib\Slicer-4.11\cli-modules\Release\GaussianBlurImageFilterLib.dll  
47\> GaussianBlurImageFilter.vcxproj → C:\D\S4R\Slicer-build\lib\Slicer-4.11\cli-modules\Release\GaussianBlurImageFilter.exe  
47\> Copying XML file ‘GaussianBlurImageFilter.xml’ along side the executable  
47\> GaussianBlurImageFilterTest.vcxproj → C:\D\S4R\Slicer-build\bin\Release\GaussianBlurImageFilterTest.exe  
47\> GenerateExpertAutomatedRegistrationTestData.vcxproj → C:\D\S4R\Slicer-build\bin\Release\GenerateExpertAutomatedRegistrationTestData.exe  
47\> GradientAnisotropicDiffusionLib.vcxproj → C:\D\S4R\Slicer-build\lib\Slicer-4.11\cli-modules\Release\GradientAnisotropicDiffusionLib.dll  
47\> GradientAnisotropicDiffusion.vcxproj → C:\D\S4R\Slicer-build\lib\Slicer-4.11\cli-modules\Release\GradientAnisotropicDiffusion.exe  
47\> Copying XML file ‘GradientAnisotropicDiffusion.xml’ along side the executable  
47\> GradientAnisotropicDiffusionTestWithImageSpacingOff.vcxproj → C:\D\S4R\Slicer-build\bin\Release\GradientAnisotropicDiffusionTestWithImageSpacingOff.exe  
47\> GradientAnisotropicDiffusionTestWithImageSpacingOn.vcxproj → C:\D\S4R\Slicer-build\bin\Release\GradientAnisotropicDiffusionTestWithImageSpacingOn.exe  
47\> GrayscaleFillHoleImageFilterLib.vcxproj → C:\D\S4R\Slicer-build\lib\Slicer-4.11\cli-modules\Release\GrayscaleFillHoleImageFilterLib.dll  
47\> GrayscaleFillHoleImageFilter.vcxproj → C:\D\S4R\Slicer-build\lib\Slicer-4.11\cli-modules\Release\GrayscaleFillHoleImageFilter.exe  
47\> Copying XML file ‘GrayscaleFillHoleImageFilter.xml’ along side the executable  
47\> GrayscaleFillHoleImageFilterTest.vcxproj → C:\D\S4R\Slicer-build\bin\Release\GrayscaleFillHoleImageFilterTest.exe  
47\> GrayscaleGrindPeakImageFilterLib.vcxproj → C:\D\S4R\Slicer-build\lib\Slicer-4.11\cli-modules\Release\GrayscaleGrindPeakImageFilterLib.dll  
47\> GrayscaleGrindPeakImageFilter.vcxproj → C:\D\S4R\Slicer-build\lib\Slicer-4.11\cli-modules\Release\GrayscaleGrindPeakImageFilter.exe  
47\> Copying XML file ‘GrayscaleGrindPeakImageFilter.xml’ along side the executable  
47\> GrayscaleGrindPeakImageFilterTest.vcxproj → C:\D\S4R\Slicer-build\bin\Release\GrayscaleGrindPeakImageFilterTest.exe  
47\> HistogramMatchingLib.vcxproj → C:\D\S4R\Slicer-build\lib\Slicer-4.11\cli-modules\Release\HistogramMatchingLib.dll  
47\> HistogramMatching.vcxproj → C:\D\S4R\Slicer-build\lib\Slicer-4.11\cli-modules\Release\HistogramMatching.exe  
47\> Copying XML file ‘HistogramMatching.xml’ along side the executable  
47\> HistogramMatchingTest.vcxproj → C:\D\S4R\Slicer-build\bin\Release\HistogramMatchingTest.exe  
47\> ImageLabelCombineLib.vcxproj → C:\D\S4R\Slicer-build\lib\Slicer-4.11\cli-modules\Release\ImageLabelCombineLib.dll  
47\> ImageLabelCombine.vcxproj → C:\D\S4R\Slicer-build\lib\Slicer-4.11\cli-modules\Release\ImageLabelCombine.exe  
47\> Copying XML file ‘ImageLabelCombine.xml’ along side the executable  
47\> ImageLabelCombineTest.vcxproj → C:\D\S4R\Slicer-build\bin\Release\ImageLabelCombineTest.exe  
47\> LabelMapSmoothingLib.vcxproj → C:\D\S4R\Slicer-build\lib\Slicer-4.11\cli-modules\Release\LabelMapSmoothingLib.dll  
47\> LabelMapSmoothing.vcxproj → C:\D\S4R\Slicer-build\lib\Slicer-4.11\cli-modules\Release\LabelMapSmoothing.exe  
47\> Copying XML file ‘LabelMapSmoothing.xml’ along side the executable  
47\> LabelMapSmoothingTest.vcxproj → C:\D\S4R\Slicer-build\bin\Release\LabelMapSmoothingTest.exe  
47\> MC2OriginLib.vcxproj → C:\D\S4R\Slicer-build\lib\Slicer-4.11\cli-modules\Release\MC2OriginLib.dll  
47\> MC2Origin.vcxproj → C:\D\S4R\Slicer-build\lib\Slicer-4.11\cli-modules\Release\MC2Origin.exe  
47\> Copying XML file ‘MC2Origin.xml’ along side the executable  
47\> MaskScalarVolumeLib.vcxproj → C:\D\S4R\Slicer-build\lib\Slicer-4.11\cli-modules\Release\MaskScalarVolumeLib.dll  
47\> MaskScalarVolume.vcxproj → C:\D\S4R\Slicer-build\lib\Slicer-4.11\cli-modules\Release\MaskScalarVolume.exe  
47\> Copying XML file ‘MaskScalarVolume.xml’ along side the executable  
47\> MaskScalarVolumeTest.vcxproj → C:\D\S4R\Slicer-build\bin\Release\MaskScalarVolumeTest.exe  
47\> MedianImageFilterLib.vcxproj → C:\D\S4R\Slicer-build\lib\Slicer-4.11\cli-modules\Release\MedianImageFilterLib.dll  
47\> MedianImageFilter.vcxproj → C:\D\S4R\Slicer-build\lib\Slicer-4.11\cli-modules\Release\MedianImageFilter.exe  
47\> Copying XML file ‘MedianImageFilter.xml’ along side the executable  
47\> MedianImageFilterTest.vcxproj → C:\D\S4R\Slicer-build\bin\Release\MedianImageFilterTest.exe  
47\> MirrorLib.vcxproj → C:\D\S4R\Slicer-build\lib\Slicer-4.11\cli-modules\Release\MirrorLib.dll  
47\> Mirror.vcxproj → C:\D\S4R\Slicer-build\lib\Slicer-4.11\cli-modules\Release\Mirror.exe  
47\> Copying XML file ‘Mirror.xml’ along side the executable  
47\> MultiplyScalarVolumesLib.vcxproj → C:\D\S4R\Slicer-build\lib\Slicer-4.11\cli-modules\Release\MultiplyScalarVolumesLib.dll  
47\> MultiplyScalarVolumes.vcxproj → C:\D\S4R\Slicer-build\lib\Slicer-4.11\cli-modules\Release\MultiplyScalarVolumes.exe  
47\> Copying XML file ‘MultiplyScalarVolumes.xml’ along side the executable  
47\> MultiplyScalarVolumesTest.vcxproj → C:\D\S4R\Slicer-build\bin\Release\MultiplyScalarVolumesTest.exe  
47\> N4ITKBiasFieldCorrectionLib.vcxproj → C:\D\S4R\Slicer-build\lib\Slicer-4.11\cli-modules\Release\N4ITKBiasFieldCorrectionLib.dll  
47\> N4ITKBiasFieldCorrection.vcxproj → C:\D\S4R\Slicer-build\lib\Slicer-4.11\cli-modules\Release\N4ITKBiasFieldCorrection.exe  
47\> Copying XML file ‘N4ITKBiasFieldCorrection.xml’ along side the executable  
47\> N4ITKBiasFieldCorrectionTest.vcxproj → C:\D\S4R\Slicer-build\bin\Release\N4ITKBiasFieldCorrectionTest.exe  
47\> NormalsLib.vcxproj → C:\D\S4R\Slicer-build\lib\Slicer-4.11\cli-modules\Release\NormalsLib.dll  
47\> Normals.vcxproj → C:\D\S4R\Slicer-build\lib\Slicer-4.11\cli-modules\Release\Normals.exe  
47\> Copying XML file ‘Normals.xml’ along side the executable  
47\> OrientScalarVolumeLib.vcxproj → C:\D\S4R\Slicer-build\lib\Slicer-4.11\cli-modules\Release\OrientScalarVolumeLib.dll  
47\> OrientScalarVolume.vcxproj → C:\D\S4R\Slicer-build\lib\Slicer-4.11\cli-modules\Release\OrientScalarVolume.exe  
47\> Copying XML file ‘OrientScalarVolume.xml’ along side the executable  
47\> OrientScalarVolumeTest.vcxproj → C:\D\S4R\Slicer-build\bin\Release\OrientScalarVolumeTest.exe  
47\> PerformMetricTestLib.vcxproj → C:\D\S4R\Slicer-build\lib\Slicer-4.11\cli-modules\Release\PerformMetricTestLib.dll  
47\> PerformMetricTest.vcxproj → C:\D\S4R\Slicer-build\lib\Slicer-4.11\cli-modules\Release\PerformMetricTest.exe  
47\> Copying XML file ‘PerformMetricTest.xml’ along side the executable  
47\> ResampleDTIVolumeLib.vcxproj → C:\D\S4R\Slicer-build\lib\Slicer-4.11\cli-modules\Release\ResampleDTIVolumeLib.dll  
47\> ResampleDTIVolume.vcxproj → C:\D\S4R\Slicer-build\lib\Slicer-4.11\cli-modules\Release\ResampleDTIVolume.exe  
47\> Copying XML file ‘ResampleDTIVolume.xml’ along side the executable  
47\> ResampleDTIVolumeTest.vcxproj → C:\D\S4R\Slicer-build\bin\Release\ResampleDTIVolumeTest.exe  
47\> ResampleScalarVectorDWIVolumeLib.vcxproj → C:\D\S4R\Slicer-build\lib\Slicer-4.11\cli-modules\Release\ResampleScalarVectorDWIVolumeLib.dll  
47\> ResampleScalarVectorDWIVolume.vcxproj → C:\D\S4R\Slicer-build\lib\Slicer-4.11\cli-modules\Release\ResampleScalarVectorDWIVolume.exe  
47\> Copying XML file ‘ResampleScalarVectorDWIVolume.xml’ along side the executable  
47\> ResampleScalarVectorDWIVolumeTest.vcxproj → C:\D\S4R\Slicer-build\bin\Release\ResampleScalarVectorDWIVolumeTest.exe  
47\> ResampleScalarVolumeLib.vcxproj → C:\D\S4R\Slicer-build\lib\Slicer-4.11\cli-modules\Release\ResampleScalarVolumeLib.dll  
47\> ResampleScalarVolume.vcxproj → C:\D\S4R\Slicer-build\lib\Slicer-4.11\cli-modules\Release\ResampleScalarVolume.exe  
47\> Copying XML file ‘ResampleScalarVolume.xml’ along side the executable  
47\> ResampleScalarVolumeTest.vcxproj → C:\D\S4R\Slicer-build\bin\Release\ResampleScalarVolumeTest.exe  
47\> RobustStatisticsSegmenterLib.vcxproj → C:\D\S4R\Slicer-build\lib\Slicer-4.11\cli-modules\Release\RobustStatisticsSegmenterLib.dll  
47\> RobustStatisticsSegmenter.vcxproj → C:\D\S4R\Slicer-build\lib\Slicer-4.11\cli-modules\Release\RobustStatisticsSegmenter.exe  
47\> Copying XML file ‘RobustStatisticsSegmenter.xml’ along side the executable  
47\> SFLSRobustStat3DTestConsole.vcxproj → C:\D\S4R\Slicer-build\bin\Release\SFLSRobustStat3DTestConsole.exe  
47\> SimpleRegionGrowingSegmentationLib.vcxproj → C:\D\S4R\Slicer-build\lib\Slicer-4.11\cli-modules\Release\SimpleRegionGrowingSegmentationLib.dll  
47\> SimpleRegionGrowingSegmentation.vcxproj → C:\D\S4R\Slicer-build\lib\Slicer-4.11\cli-modules\Release\SimpleRegionGrowingSegmentation.exe  
47\> Copying XML file ‘SimpleRegionGrowingSegmentation.xml’ along side the executable  
47\> SimpleRegionGrowingSegmentationTest.vcxproj → C:\D\S4R\Slicer-build\bin\Release\SimpleRegionGrowingSegmentationTest.exe  
47\> SmoothingLib.vcxproj → C:\D\S4R\Slicer-build\lib\Slicer-4.11\cli-modules\Release\SmoothingLib.dll  
47\> Smoothing.vcxproj → C:\D\S4R\Slicer-build\lib\Slicer-4.11\cli-modules\Release\Smoothing.exe  
47\> Copying XML file ‘Smoothing.xml’ along side the executable  
47\> SubtractScalarVolumesLib.vcxproj → C:\D\S4R\Slicer-build\lib\Slicer-4.11\cli-modules\Release\SubtractScalarVolumesLib.dll  
47\> SubtractScalarVolumes.vcxproj → C:\D\S4R\Slicer-build\lib\Slicer-4.11\cli-modules\Release\SubtractScalarVolumes.exe  
47\> Copying XML file ‘SubtractScalarVolumes.xml’ along side the executable  
47\> SubtractScalarVolumesTest.vcxproj → C:\D\S4R\Slicer-build\bin\Release\SubtractScalarVolumesTest.exe  
47\> TestGridTransformRegistrationLib.vcxproj → C:\D\S4R\Slicer-build\lib\Slicer-4.11\cli-modules\Release\TestGridTransformRegistrationLib.dll  
47\> TestGridTransformRegistration.vcxproj → C:\D\S4R\Slicer-build\lib\Slicer-4.11\cli-modules\Release\TestGridTransformRegistration.exe  
47\> Copying XML file ‘TestGridTransformRegistration.xml’ along side the executable  
47\> TestGridTransformRegistrationTest.vcxproj → C:\D\S4R\Slicer-build\bin\Release\TestGridTransformRegistrationTest.exe  
47\> ThresholdScalarVolumeLib.vcxproj → C:\D\S4R\Slicer-build\lib\Slicer-4.11\cli-modules\Release\ThresholdScalarVolumeLib.dll  
47\> ThresholdScalarVolume.vcxproj → C:\D\S4R\Slicer-build\lib\Slicer-4.11\cli-modules\Release\ThresholdScalarVolume.exe  
47\> Copying XML file ‘ThresholdScalarVolume.xml’ along side the executable  
47\> ThresholdScalarVolumeTest.vcxproj → C:\D\S4R\Slicer-build\bin\Release\ThresholdScalarVolumeTest.exe  
47\> VTKITKVectorReader.vcxproj → C:\D\S4R\Slicer-build\bin\Release\VTKITKVectorReader.exe  
47\> VotingBinaryHoleFillingImageFilterLib.vcxproj → C:\D\S4R\Slicer-build\lib\Slicer-4.11\cli-modules\Release\VotingBinaryHoleFillingImageFilterLib.dll  
47\> VotingBinaryHoleFillingImageFilter.vcxproj → C:\D\S4R\Slicer-build\lib\Slicer-4.11\cli-modules\Release\VotingBinaryHoleFillingImageFilter.exe  
47\> Copying XML file ‘VotingBinaryHoleFillingImageFilter.xml’ along side the executable  
47\> VotingBinaryHoleFillingImageFilterTest.vcxproj → C:\D\S4R\Slicer-build\bin\Release\VotingBinaryHoleFillingImageFilterTest.exe  
47\> qSlicerIconEnginePlugin.vcxproj → C:\D\S4R\Slicer-build\bin\iconengines\Release\qSlicerIconEnginePlugin.dll  
47\> relaxPolygonsLib.vcxproj → C:\D\S4R\Slicer-build\lib\Slicer-4.11\cli-modules\Release\relaxPolygonsLib.dll  
47\> relaxPolygons.vcxproj → C:\D\S4R\Slicer-build\lib\Slicer-4.11\cli-modules\Release\relaxPolygons.exe  
47\> Copying XML file ‘relaxPolygons.xml’ along side the executable  
47\> scaleMeshLib.vcxproj → C:\D\S4R\Slicer-build\lib\Slicer-4.11\cli-modules\Release\scaleMeshLib.dll  
47\> scaleMesh.vcxproj → C:\D\S4R\Slicer-build\lib\Slicer-4.11\cli-modules\Release\scaleMesh.exe  
47\> Copying XML file ‘scaleMesh.xml’ along side the executable  
47\> translateMeshLib.vcxproj → C:\D\S4R\Slicer-build\lib\Slicer-4.11\cli-modules\Release\translateMeshLib.dll  
47\> translateMesh.vcxproj → C:\D\S4R\Slicer-build\lib\Slicer-4.11\cli-modules\Release\translateMesh.exe  
47\> Copying XML file ‘translateMesh.xml’ along side the executable  
47\> vtkAddonCxxTests.vcxproj → C:\D\S4R\Slicer-build\bin\Release\vtkAddonCxxTests.exe  
47\> vtkAddonPythonD.vcxproj → C:\D\S4R\Slicer-build\bin\Release\vtkAddonPythonD.dll  
47\> vtkAddonPython.vcxproj → C:\D\S4R\Slicer-build\bin\Release\vtkAddonPython.pyd  
47\> vtkITKPythonD.vcxproj → C:\D\S4R\Slicer-build\bin\Release\vtkITKPythonD.dll  
47\> vtkITKPython.vcxproj → C:\D\S4R\Slicer-build\bin\Release\vtkITKPython.pyd  
47\> vtkSegmentationCoreCxxTests.cxx  
47\> vtkSegmentationTest1.cxx  
47\> vtkSegmentationTest2.cxx  
47\> vtkSegmentationHistoryTest1.cxx  
47\> vtkSegmentationConverterTest1.cxx  
47\> vtkClosedSurfaceToFractionalLabelMapConversionTest1.cxx  
47\> 코드를 생성하고 있습니다…  
47\> vtkSegmentationCoreCxxTests.vcxproj → C:\D\S4R\Slicer-build\bin\Release\vtkSegmentationCoreCxxTests.exe  
47\> Python Wrapping - generating vtkOrientedImageDataPython.cxx  
47\> Python Wrapping - generating vtkOrientedImageDataResamplePython.cxx  
47\> Python Wrapping - generating vtkSegmentPython.cxx  
47\> Python Wrapping - generating vtkSegmentationPython.cxx  
47\> Python Wrapping - generating vtkSegmentationConverterPython.cxx  
47\> Python Wrapping - generating vtkSegmentationConverterFactoryPython.cxx  
47\> Python Wrapping - generating vtkSegmentationConverterRulePython.cxx  
47\> Python Wrapping - generating vtkSegmentationHistoryPython.cxx  
47\> Python Wrapping - generating vtkSegmentationModifierPython.cxx  
47\> Python Wrapping - generating vtkTopologicalHierarchyPython.cxx  
47\> Python Wrapping - generating vtkBinaryLabelmapToClosedSurfaceConversionRulePython.cxx  
47\> Python Wrapping - generating vtkClosedSurfaceToBinaryLabelmapConversionRulePython.cxx  
47\> Python Wrapping - generating vtkCalculateOversamplingFactorPython.cxx  
47\> Python Wrapping - generating vtkClosedSurfaceToFractionalLabelmapConversionRulePython.cxx  
47\> Python Wrapping - generating vtkFractionalLabelmapToClosedSurfaceConversionRulePython.cxx  
47\> Python Wrapping - generating vtkPolyDataToFractionalLabelmapFilterPython.cxx  
47\> vtkOrientedImageDataPython.cxx  
47\> vtkOrientedImageDataResamplePython.cxx  
47\> vtkSegmentPython.cxx  
47\> vtkSegmentationPython.cxx  
47\> vtkSegmentationConverterPython.cxx  
47\> vtkSegmentationConverterFactoryPython.cxx  
47\> vtkSegmentationConverterRulePython.cxx  
47\> vtkSegmentationHistoryPython.cxx  
47\> vtkSegmentationModifierPython.cxx  
47\> vtkTopologicalHierarchyPython.cxx  
47\> vtkBinaryLabelmapToClosedSurfaceConversionRulePython.cxx  
47\> vtkClosedSurfaceToBinaryLabelmapConversionRulePython.cxx  
47\> vtkCalculateOversamplingFactorPython.cxx  
47\> vtkClosedSurfaceToFractionalLabelmapConversionRulePython.cxx  
47\> vtkFractionalLabelmapToClosedSurfaceConversionRulePython.cxx  
47\> vtkPolyDataToFractionalLabelmapFilterPython.cxx  
47\> vtkSegmentationCorePythonInitImpl.cxx  
47\> 코드를 생성하고 있습니다…  
47\> C:/D/S4R/Slicer-build/lib/Slicer-4.11/Release/vtkSegmentationCorePythonD.lib 라이브러리 및 C:/D/S4R/Slicer-build/lib/Slicer-4.11/Release/vtkSegmentationCorePythonD.exp 개체를 생성하고 있습니다.  
47\> vtkSegmentationCorePythonD.vcxproj → C:\D\S4R\Slicer-build\bin\Release\vtkSegmentationCorePythonD.dll  
47\> vtkSegmentationCorePythonInit.cxx  
47\> C:/D/S4R/Slicer-build/lib/Slicer-4.11/Release/vtkSegmentationCorePython.lib 라이브러리 및 C:/D/S4R/Slicer-build/lib/Slicer-4.11/Release/vtkSegmentationCorePython.exp 개체를 생성하고 있습니다.  
47\> vtkSegmentationCorePython.vcxproj → C:\D\S4R\Slicer-build\bin\Release\vtkSegmentationCorePython.pyd  
47\> vtkTeemPythonD.vcxproj → C:\D\S4R\Slicer-build\bin\Release\vtkTeemPythonD.dll  
47\> vtkTeemCxxTests.vcxproj → C:\D\S4R\Slicer-build\bin\Release\vtkTeemCxxTests.exe  
47\> vtkTeemPython.vcxproj → C:\D\S4R\Slicer-build\bin\Release\vtkTeemPython.pyd  
47\>“Slicer.vcxproj” 프로젝트를 빌드했습니다. - 실패  
========== 빌드: 성공 45, 실패 2, 최신 1, 생략 0 ==========

---

<div class="post-metadata">

**Author:** ![kookoo9999](https://sea2.discourse-cdn.com/flex002/user_avatar/discourse.slicer.org/kookoo9999/32/12394_2.png) [@kookoo9999](https://discourse.slicer.org/u/kookoo9999)\
**Post date:** [September 21, 2021, 6:23am UTC](https://discourse.slicer.org/t/failed-build-slicer-in-windows10-with-visual-studio-2017-qt-5-10-1/19718/8 "2021-09-21T06:23:39Z")

</div>

I am using Visual Studio 2017 v141 toolset, Qt 5.10.1 , CMake 3.15. when I try to build for Slicer-Master I can’t configure in CMake. and I changed Slicer Source from Master to 4.11 20200930 I succeeded configure and generate but failed build in Visual Studio …  
I am curious about your environment (about source : Slicer-Master, Visual Sutido’s version and toolset,CMake…Qt version)

---

<div class="post-metadata">

**Author:** ![lassoan](https://sea2.discourse-cdn.com/flex002/user_avatar/discourse.slicer.org/lassoan/32/13_2.png) [@lassoan](https://discourse.slicer.org/u/lassoan)\
**Post date:** [September 21, 2021, 12:03pm UTC](https://discourse.slicer.org/t/failed-build-slicer-in-windows10-with-visual-studio-2017-qt-5-10-1/19718/9 "2021-09-21T12:03:27Z")

</div>

It is normal that the build fails if you use older tool or library versions than the required.

As described in the [build instructions](https://slicer.readthedocs.io/en/latest/developer_guide/build_instructions/windows.html), you need to use Visual Studio 2019 with toolset v142, Qt-5.15.x.

---

<div class="post-metadata">

**Author:** ![kookoo9999](https://sea2.discourse-cdn.com/flex002/user_avatar/discourse.slicer.org/kookoo9999/32/12394_2.png) [@kookoo9999](https://discourse.slicer.org/u/kookoo9999)\
**Post date:** [September 22, 2021, 10:16am UTC](https://discourse.slicer.org/t/failed-build-slicer-in-windows10-with-visual-studio-2017-qt-5-10-1/19718/11 "2021-09-22T10:16:27Z")

</div>

I can’t buy a license and use Qt…  
So I use and try visual studio 2107, toolset v141, Qt 5.10.1…(5.12.1 …) and every try is failed…

---

<div class="post-metadata">

**Author:** ![pieper](https://sea2.discourse-cdn.com/flex002/user_avatar/discourse.slicer.org/pieper/32/8_2.png) [@pieper](https://discourse.slicer.org/u/pieper)\
**Post date:** [September 22, 2021, 12:25pm UTC](https://discourse.slicer.org/t/failed-build-slicer-in-windows10-with-visual-studio-2017-qt-5-10-1/19718/12 "2021-09-22T12:25:28Z")

</div>

You can get 5.15.2 for free from [Open Source Development | Open Source License | Qt](https://www.qt.io/download-open-source?hsCtaTracking=9f6a2170-a938-42df-a8e2-a9f0b1d6cdce%7C6cb0de4f-9bb5-4778-ab02-bfb62735f3e5)

---

<div class="post-metadata">

**Author:** ![kookoo9999](https://sea2.discourse-cdn.com/flex002/user_avatar/discourse.slicer.org/kookoo9999/32/12394_2.png) [@kookoo9999](https://discourse.slicer.org/u/kookoo9999)\
**Post date:** [September 22, 2021, 1:30pm UTC](https://discourse.slicer.org/t/failed-build-slicer-in-windows10-with-visual-studio-2017-qt-5-10-1/19718/14 "2021-09-22T13:30:03Z")

</div>

After fail with 5.12 , now I am using 5.10.1 because I saw on the forum that you should write 5.10.1.  
Did you succeed to build in Windows10 ??

---

<div class="post-metadata">

**Author:** ![pieper](https://sea2.discourse-cdn.com/flex002/user_avatar/discourse.slicer.org/pieper/32/8_2.png) [@pieper](https://discourse.slicer.org/u/pieper)\
**Post date:** [September 22, 2021, 1:57pm UTC](https://discourse.slicer.org/t/failed-build-slicer-in-windows10-with-visual-studio-2017-qt-5-10-1/19718/15 "2021-09-22T13:57:06Z")

</div>

You need to use the latest Qt (5.15.2) not an old version. Yes, my build works fine on windows 10 with visual studio 2019.

---

<div class="post-metadata">

**Author:** ![kookoo9999](https://sea2.discourse-cdn.com/flex002/user_avatar/discourse.slicer.org/kookoo9999/32/12394_2.png) [@kookoo9999](https://discourse.slicer.org/u/kookoo9999)\
**Post date:** [September 22, 2021, 5:39pm UTC](https://discourse.slicer.org/t/failed-build-slicer-in-windows10-with-visual-studio-2017-qt-5-10-1/19718/17 "2021-09-22T17:39:27Z")

</div>

I just tried build Slicer-Master via Qt(5.15.1),VisualStudio 2019 (toolset v142) but failed too…

---

<div class="post-metadata">

**Author:** ![jamesobutler](https://sea2.discourse-cdn.com/flex002/user_avatar/discourse.slicer.org/jamesobutler/32/7511_2.png) [@jamesobutler](https://discourse.slicer.org/u/jamesobutler)\
**Post date:** [September 22, 2021, 5:42pm UTC](https://discourse.slicer.org/t/failed-build-slicer-in-windows10-with-visual-studio-2017-qt-5-10-1/19718/18 "2021-09-22T17:42:32Z")

</div>

Are you using a recent version of CMake? Your first image showed you were using 3.15.0-rc1? I’ve been successful building a recent Slicer `master` branch using CMake 3.21.2, Qt 5.15.2, and Visual Studio 2019 (v142).

When you are trying different versions are you clearing out your build tree completely and starting a fresh build?

---

<div class="post-metadata">

**Author:** ![kookoo9999](https://sea2.discourse-cdn.com/flex002/user_avatar/discourse.slicer.org/kookoo9999/32/12394_2.png) [@kookoo9999](https://discourse.slicer.org/u/kookoo9999)\
**Post date:** [September 22, 2021, 5:46pm UTC](https://discourse.slicer.org/t/failed-build-slicer-in-windows10-with-visual-studio-2017-qt-5-10-1/19718/20 "2021-09-22T17:46:46Z")

</div>

ow I will try to build Slicer master branch after change CMake version and for fresh build , I will delete build tree change the Qt 5.15.2 and try again

---

<div class="post-metadata">

**Author:** ![kookoo9999](https://sea2.discourse-cdn.com/flex002/user_avatar/discourse.slicer.org/kookoo9999/32/12394_2.png) [@kookoo9999](https://discourse.slicer.org/u/kookoo9999)\
**Post date:** [September 23, 2021, 6:08am UTC](https://discourse.slicer.org/t/failed-build-slicer-in-windows10-with-visual-studio-2017-qt-5-10-1/19718/21 "2021-09-23T06:08:46Z")

</div>

@jamesobutler@lassoan  
After I did clear the build tree, then I tried to build Slicer master branch via changed env Visual Studio 2019 (toolset v142) , Qt5.15.2, CMake 3.21.3 but build is failed…  
S4R\slicer.sln is can’t build and I can’t find slicer.exe,  
I don’t know why I can’t build . Please give me some advice.  
Attached is the result CMake txt below.

---

<div class="post-metadata">

**Author:** ![kookoo9999](https://sea2.discourse-cdn.com/flex002/user_avatar/discourse.slicer.org/kookoo9999/32/12394_2.png) [@kookoo9999](https://discourse.slicer.org/u/kookoo9999)\
**Post date:** [September 23, 2021, 6:13am UTC](https://discourse.slicer.org/t/failed-build-slicer-in-windows10-with-visual-studio-2017-qt-5-10-1/19718/22 "2021-09-23T06:13:39Z")

</div>

C:\D\S4R\slicer-build\CMakeFiles\CMakeError.txt

Determining if the CXX compiler accepts the flag -features=no%anachronisms passed with the following output:  
Change Dir: C:/D/S4R/Slicer-build/CMakeFiles/CMakeTmp

Run Build Command(s):C:/Program Files (x86)/Microsoft Visual Studio/2019/Community/MSBuild/Current/Bin/MSBuild.exe cmTC\_04fe8.vcxproj /p:Configuration=Debug /p:Platform=x64 /p:VisualStudioVersion=16.0 /v:m && .NET Framework용 Microsoft (R) Build Engine 버전 16.11.0+0538acc04

Copyright (C) Microsoft Corporation. All rights reserved.

Microsoft (R) C/C++ 최적화 컴파일러 버전 19.29.30133(x64)

Copyright (c) Microsoft Corporation. All rights reserved.

src.cxx

cl /c /Zi /W2 /WX- /diagnostics:column /Od /Ob0 /D \_MBCS /D WIN32 /D \_WINDOWS /D “CMAKE\_INTDIR=“Debug”” /Gm- /EHsc /RTC1 /MDd /GS /fp:precise /Zc:wchar\_t /Zc:forScope /Zc:inline /GR /Fo"cmTC\_04fe8.dir\Debug\" /Fd"cmTC\_04fe8.dir\Debug\vc142.pdb" /external:W2 /Gd /TP /errorReport:queue -features=no%%anachronisms “C:\D\S4R\Slicer-build\CMakeFiles\CMakeTmp\src.cxx”

cl : 명령줄 warning D9002: 알 수 없는 ‘-features=no%%anachronisms’ 옵션을 무시합니다. [C:\D\S4R\Slicer-build\CMakeFiles\CMakeTmp\cmTC\_04fe8.vcxproj]

cmTC\_04fe8.vcxproj → C:\D\S4R\Slicer-build\CMakeFiles\CMakeTmp\Debug\cmTC\_04fe8.exe

Source file was:  
int main() { return 0;}

Performing C SOURCE FILE Test C\_HAS\_WARNING-Wno-uninitialized failed with the following output:  
Change Dir: C:/D/S4R/Slicer-build/CMakeFiles/CMakeTmp

Run Build Command(s):C:/Program Files (x86)/Microsoft Visual Studio/2019/Community/MSBuild/Current/Bin/MSBuild.exe cmTC\_f66fd.vcxproj /p:Configuration=Debug /p:Platform=x64 /p:VisualStudioVersion=16.0 /v:m && .NET Framework용 Microsoft (R) Build Engine 버전 16.11.0+0538acc04

Copyright (C) Microsoft Corporation. All rights reserved.

Microsoft (R) C/C++ 최적화 컴파일러 버전 19.29.30133(x64)

Copyright (c) Microsoft Corporation. All rights reserved.

cl /c /Zi /W2 /WX- /diagnostics:column /Od /Ob0 /D \_MBCS /D WIN32 /D \_WINDOWS /D “C\_HAS\_WARNING-Wno-uninitialized” /D “CMAKE\_INTDIR=“Debug”” /Gm- /RTC1 /MDd /GS /fp:precise /Zc:wchar\_t /Zc:forScope /Zc:inline /Fo"cmTC\_f66fd.dir\Debug\" /Fd"cmTC\_f66fd.dir\Debug\vc142.pdb" /external:W2 /Gd /TC /errorReport:queue /bigobj -Wno-uninitialized “C:\D\S4R\Slicer-build\CMakeFiles\CMakeTmp\src.c”

cl : 명령줄 error D8021: ‘/Wno-uninitialized’ 숫자 인수가 잘못되었습니다. [C:\D\S4R\Slicer-build\CMakeFiles\CMakeTmp\cmTC\_f66fd.vcxproj]

Source file was:  
int main(void) { return 0; }  
Performing C SOURCE FILE Test C\_HAS\_WARNING-Wno-unused-parameter failed with the following output:  
Change Dir: C:/D/S4R/Slicer-build/CMakeFiles/CMakeTmp

Run Build Command(s):C:/Program Files (x86)/Microsoft Visual Studio/2019/Community/MSBuild/Current/Bin/MSBuild.exe cmTC\_4be86.vcxproj /p:Configuration=Debug /p:Platform=x64 /p:VisualStudioVersion=16.0 /v:m && .NET Framework용 Microsoft (R) Build Engine 버전 16.11.0+0538acc04

Copyright (C) Microsoft Corporation. All rights reserved.

Microsoft (R) C/C++ 최적화 컴파일러 버전 19.29.30133(x64)

Copyright (c) Microsoft Corporation. All rights reserved.

cl /c /Zi /W2 /WX- /diagnostics:column /Od /Ob0 /D \_MBCS /D WIN32 /D \_WINDOWS /D “C\_HAS\_WARNING-Wno-unused-parameter” /D “CMAKE\_INTDIR=“Debug”” /Gm- /RTC1 /MDd /GS /fp:precise /Zc:wchar\_t /Zc:forScope /Zc:inline /Fo"cmTC\_4be86.dir\Debug\" /Fd"cmTC\_4be86.dir\Debug\vc142.pdb" /external:W2 /Gd /TC /errorReport:queue /bigobj -Wno-unused-parameter “C:\D\S4R\Slicer-build\CMakeFiles\CMakeTmp\src.c”

cl : 명령줄 error D8021: ‘/Wno-unused-parameter’ 숫자 인수가 잘못되었습니다. [C:\D\S4R\Slicer-build\CMakeFiles\CMakeTmp\cmTC\_4be86.vcxproj]

Source file was:  
int main(void) { return 0; }  
Performing C SOURCE FILE Test C\_HAS\_WARNING-Wno-long-double failed with the following output:  
Change Dir: C:/D/S4R/Slicer-build/CMakeFiles/CMakeTmp

Run Build Command(s):C:/Program Files (x86)/Microsoft Visual Studio/2019/Community/MSBuild/Current/Bin/MSBuild.exe cmTC\_a09aa.vcxproj /p:Configuration=Debug /p:Platform=x64 /p:VisualStudioVersion=16.0 /v:m && .NET Framework용 Microsoft (R) Build Engine 버전 16.11.0+0538acc04

Copyright (C) Microsoft Corporation. All rights reserved.

Microsoft (R) C/C++ 최적화 컴파일러 버전 19.29.30133(x64)

Copyright (c) Microsoft Corporation. All rights reserved.

cl /c /Zi /W2 /WX- /diagnostics:column /Od /Ob0 /D \_MBCS /D WIN32 /D \_WINDOWS /D “C\_HAS\_WARNING-Wno-long-double” /D “CMAKE\_INTDIR=“Debug”” /Gm- /RTC1 /MDd /GS /fp:precise /Zc:wchar\_t /Zc:forScope /Zc:inline /Fo"cmTC\_a09aa.dir\Debug\" /Fd"cmTC\_a09aa.dir\Debug\vc142.pdb" /external:W2 /Gd /TC /errorReport:queue /bigobj -Wno-long-double “C:\D\S4R\Slicer-build\CMakeFiles\CMakeTmp\src.c”

cl : 명령줄 error D8021: ‘/Wno-long-double’ 숫자 인수가 잘못되었습니다. [C:\D\S4R\Slicer-build\CMakeFiles\CMakeTmp\cmTC\_a09aa.vcxproj]

Source file was:  
int main(void) { return 0; }  
Performing C SOURCE FILE Test C\_HAS\_WARNING-Wcast-align failed with the following output:  
Change Dir: C:/D/S4R/Slicer-build/CMakeFiles/CMakeTmp

Run Build Command(s):C:/Program Files (x86)/Microsoft Visual Studio/2019/Community/MSBuild/Current/Bin/MSBuild.exe cmTC\_05260.vcxproj /p:Configuration=Debug /p:Platform=x64 /p:VisualStudioVersion=16.0 /v:m && .NET Framework용 Microsoft (R) Build Engine 버전 16.11.0+0538acc04

Copyright (C) Microsoft Corporation. All rights reserved.

Microsoft (R) C/C++ 최적화 컴파일러 버전 19.29.30133(x64)

Copyright (c) Microsoft Corporation. All rights reserved.

cl /c /Zi /W2 /WX- /diagnostics:column /Od /Ob0 /D \_MBCS /D WIN32 /D \_WINDOWS /D “C\_HAS\_WARNING-Wcast-align” /D “CMAKE\_INTDIR=“Debug”” /Gm- /RTC1 /MDd /GS /fp:precise /Zc:wchar\_t /Zc:forScope /Zc:inline /Fo"cmTC\_05260.dir\Debug\" /Fd"cmTC\_05260.dir\Debug\vc142.pdb" /external:W2 /Gd /TC /errorReport:queue /bigobj -Wcast-align “C:\D\S4R\Slicer-build\CMakeFiles\CMakeTmp\src.c”

cl : 명령줄 error D8021: ‘/Wcast-align’ 숫자 인수가 잘못되었습니다. [C:\D\S4R\Slicer-build\CMakeFiles\CMakeTmp\cmTC\_05260.vcxproj]

Source file was:  
int main(void) { return 0; }  
Performing C SOURCE FILE Test C\_HAS\_WARNING-Wdisabled-optimization failed with the following output:  
Change Dir: C:/D/S4R/Slicer-build/CMakeFiles/CMakeTmp

Run Build Command(s):C:/Program Files (x86)/Microsoft Visual Studio/2019/Community/MSBuild/Current/Bin/MSBuild.exe cmTC\_15a34.vcxproj /p:Configuration=Debug /p:Platform=x64 /p:VisualStudioVersion=16.0 /v:m && .NET Framework용 Microsoft (R) Build Engine 버전 16.11.0+0538acc04

Copyright (C) Microsoft Corporation. All rights reserved.

Microsoft (R) C/C++ 최적화 컴파일러 버전 19.29.30133(x64)

Copyright (c) Microsoft Corporation. All rights reserved.

cl /c /Zi /W2 /WX- /diagnostics:column /Od /Ob0 /D \_MBCS /D WIN32 /D \_WINDOWS /D “C\_HAS\_WARNING-Wdisabled-optimization” /D “CMAKE\_INTDIR=“Debug”” /Gm- /RTC1 /MDd /GS /fp:precise /Zc:wchar\_t /Zc:forScope /Zc:inline /Fo"cmTC\_15a34.dir\Debug\" /Fd"cmTC\_15a34.dir\Debug\vc142.pdb" /external:W2 /Gd /TC /errorReport:queue /bigobj -Wdisabled-optimization “C:\D\S4R\Slicer-build\CMakeFiles\CMakeTmp\src.c”

cl : 명령줄 error D8021: ‘/Wdisabled-optimization’ 숫자 인수가 잘못되었습니다. [C:\D\S4R\Slicer-build\CMakeFiles\CMakeTmp\cmTC\_15a34.vcxproj]

Source file was:  
int main(void) { return 0; }  
Performing C SOURCE FILE Test C\_HAS\_WARNING-Wextra failed with the following output:  
Change Dir: C:/D/S4R/Slicer-build/CMakeFiles/CMakeTmp

Run Build Command(s):C:/Program Files (x86)/Microsoft Visual Studio/2019/Community/MSBuild/Current/Bin/MSBuild.exe cmTC\_9e748.vcxproj /p:Configuration=Debug /p:Platform=x64 /p:VisualStudioVersion=16.0 /v:m && .NET Framework용 Microsoft (R) Build Engine 버전 16.11.0+0538acc04

Copyright (C) Microsoft Corporation. All rights reserved.

Microsoft (R) C/C++ 최적화 컴파일러 버전 19.29.30133(x64)

Copyright (c) Microsoft Corporation. All rights reserved.

cl /c /Zi /W2 /WX- /diagnostics:column /Od /Ob0 /D \_MBCS /D WIN32 /D \_WINDOWS /D “C\_HAS\_WARNING-Wextra” /D “CMAKE\_INTDIR=“Debug”” /Gm- /RTC1 /MDd /GS /fp:precise /Zc:wchar\_t /Zc:forScope /Zc:inline /Fo"cmTC\_9e748.dir\Debug\" /Fd"cmTC\_9e748.dir\Debug\vc142.pdb" /external:W2 /Gd /TC /errorReport:queue /bigobj -Wextra “C:\D\S4R\Slicer-build\CMakeFiles\CMakeTmp\src.c”

cl : 명령줄 error D8021: ‘/Wextra’ 숫자 인수가 잘못되었습니다. [C:\D\S4R\Slicer-build\CMakeFiles\CMakeTmp\cmTC\_9e748.vcxproj]

Source file was:  
int main(void) { return 0; }  
Performing C SOURCE FILE Test C\_HAS\_WARNING-Wformat\_2 failed with the following output:  
Change Dir: C:/D/S4R/Slicer-build/CMakeFiles/CMakeTmp

Run Build Command(s):C:/Program Files (x86)/Microsoft Visual Studio/2019/Community/MSBuild/Current/Bin/MSBuild.exe cmTC\_185f0.vcxproj /p:Configuration=Debug /p:Platform=x64 /p:VisualStudioVersion=16.0 /v:m && .NET Framework용 Microsoft (R) Build Engine 버전 16.11.0+0538acc04

Copyright (C) Microsoft Corporation. All rights reserved.

Microsoft (R) C/C++ 최적화 컴파일러 버전 19.29.30133(x64)

Copyright (c) Microsoft Corporation. All rights reserved.

cl /c /Zi /W2 /WX- /diagnostics:column /Od /Ob0 /D \_MBCS /D WIN32 /D \_WINDOWS /D “C\_HAS\_WARNING-Wformat\_2” /D “CMAKE\_INTDIR=“Debug”” /Gm- /RTC1 /MDd /GS /fp:precise /Zc:wchar\_t /Zc:forScope /Zc:inline /Fo"cmTC\_185f0.dir\Debug\" /Fd"cmTC\_185f0.dir\Debug\vc142.pdb" /external:W2 /Gd /TC /errorReport:queue /bigobj -Wformat=2 “C:\D\S4R\Slicer-build\CMakeFiles\CMakeTmp\src.c”

cl : 명령줄 error D8021: ‘/Wformat=2’ 숫자 인수가 잘못되었습니다. [C:\D\S4R\Slicer-build\CMakeFiles\CMakeTmp\cmTC\_185f0.vcxproj]

Source file was:  
int main(void) { return 0; }  
Performing C SOURCE FILE Test C\_HAS\_WARNING-Winvalid-pch failed with the following output:  
Change Dir: C:/D/S4R/Slicer-build/CMakeFiles/CMakeTmp

Run Build Command(s):C:/Program Files (x86)/Microsoft Visual Studio/2019/Community/MSBuild/Current/Bin/MSBuild.exe cmTC\_4d589.vcxproj /p:Configuration=Debug /p:Platform=x64 /p:VisualStudioVersion=16.0 /v:m && .NET Framework용 Microsoft (R) Build Engine 버전 16.11.0+0538acc04

Copyright (C) Microsoft Corporation. All rights reserved.

Microsoft (R) C/C++ 최적화 컴파일러 버전 19.29.30133(x64)

Copyright (c) Microsoft Corporation. All rights reserved.

cl /c /Zi /W2 /WX- /diagnostics:column /Od /Ob0 /D \_MBCS /D WIN32 /D \_WINDOWS /D “C\_HAS\_WARNING-Winvalid-pch” /D “CMAKE\_INTDIR=“Debug”” /Gm- /RTC1 /MDd /GS /fp:precise /Zc:wchar\_t /Zc:forScope /Zc:inline /Fo"cmTC\_4d589.dir\Debug\" /Fd"cmTC\_4d589.dir\Debug\vc142.pdb" /external:W2 /Gd /TC /errorReport:queue /bigobj -Winvalid-pch “C:\D\S4R\Slicer-build\CMakeFiles\CMakeTmp\src.c”

cl : 명령줄 error D8021: ‘/Winvalid-pch’ 숫자 인수가 잘못되었습니다. [C:\D\S4R\Slicer-build\CMakeFiles\CMakeTmp\cmTC\_4d589.vcxproj]

Source file was:  
int main(void) { return 0; }  
Performing C SOURCE FILE Test C\_HAS\_WARNING-Wno-format-nonliteral failed with the following output:  
Change Dir: C:/D/S4R/Slicer-build/CMakeFiles/CMakeTmp

Run Build Command(s):C:/Program Files (x86)/Microsoft Visual Studio/2019/Community/MSBuild/Current/Bin/MSBuild.exe cmTC\_1efac.vcxproj /p:Configuration=Debug /p:Platform=x64 /p:VisualStudioVersion=16.0 /v:m && .NET Framework용 Microsoft (R) Build Engine 버전 16.11.0+0538acc04

Copyright (C) Microsoft Corporation. All rights reserved.

Microsoft (R) C/C++ 최적화 컴파일러 버전 19.29.30133(x64)

Copyright (c) Microsoft Corporation. All rights reserved.

cl /c /Zi /W2 /WX- /diagnostics:column /Od /Ob0 /D \_MBCS /D WIN32 /D \_WINDOWS /D “C\_HAS\_WARNING-Wno-format-nonliteral” /D “CMAKE\_INTDIR=“Debug”” /Gm- /RTC1 /MDd /GS /fp:precise /Zc:wchar\_t /Zc:forScope /Zc:inline /Fo"cmTC\_1efac.dir\Debug\" /Fd"cmTC\_1efac.dir\Debug\vc142.pdb" /external:W2 /Gd /TC /errorReport:queue /bigobj -Wno-format-nonliteral “C:\D\S4R\Slicer-build\CMakeFiles\CMakeTmp\src.c”

cl : 명령줄 error D8021: ‘/Wno-format-nonliteral’ 숫자 인수가 잘못되었습니다. [C:\D\S4R\Slicer-build\CMakeFiles\CMakeTmp\cmTC\_1efac.vcxproj]

Source file was:  
int main(void) { return 0; }  
Performing C SOURCE FILE Test C\_HAS\_WARNING-Wpointer-arith failed with the following output:  
Change Dir: C:/D/S4R/Slicer-build/CMakeFiles/CMakeTmp

Run Build Command(s):C:/Program Files (x86)/Microsoft Visual Studio/2019/Community/MSBuild/Current/Bin/MSBuild.exe cmTC\_f6a2a.vcxproj /p:Configuration=Debug /p:Platform=x64 /p:VisualStudioVersion=16.0 /v:m && .NET Framework용 Microsoft (R) Build Engine 버전 16.11.0+0538acc04

Copyright (C) Microsoft Corporation. All rights reserved.

Microsoft (R) C/C++ 최적화 컴파일러 버전 19.29.30133(x64)

Copyright (c) Microsoft Corporation. All rights reserved.

cl /c /Zi /W2 /WX- /diagnostics:column /Od /Ob0 /D \_MBCS /D WIN32 /D \_WINDOWS /D “C\_HAS\_WARNING-Wpointer-arith” /D “CMAKE\_INTDIR=“Debug”” /Gm- /RTC1 /MDd /GS /fp:precise /Zc:wchar\_t /Zc:forScope /Zc:inline /Fo"cmTC\_f6a2a.dir\Debug\" /Fd"cmTC\_f6a2a.dir\Debug\vc142.pdb" /external:W2 /Gd /TC /errorReport:queue /bigobj -Wpointer-arith “C:\D\S4R\Slicer-build\CMakeFiles\CMakeTmp\src.c”

cl : 명령줄 error D8021: ‘/Wpointer-arith’ 숫자 인수가 잘못되었습니다. [C:\D\S4R\Slicer-build\CMakeFiles\CMakeTmp\cmTC\_f6a2a.vcxproj]

Source file was:  
int main(void) { return 0; }  
Performing C SOURCE FILE Test C\_HAS\_WARNING-Wshadow failed with the following output:  
Change Dir: C:/D/S4R/Slicer-build/CMakeFiles/CMakeTmp

Run Build Command(s):C:/Program Files (x86)/Microsoft Visual Studio/2019/Community/MSBuild/Current/Bin/MSBuild.exe cmTC\_fc650.vcxproj /p:Configuration=Debug /p:Platform=x64 /p:VisualStudioVersion=16.0 /v:m && .NET Framework용 Microsoft (R) Build Engine 버전 16.11.0+0538acc04

Copyright (C) Microsoft Corporation. All rights reserved.

Microsoft (R) C/C++ 최적화 컴파일러 버전 19.29.30133(x64)

Copyright (c) Microsoft Corporation. All rights reserved.

cl /c /Zi /W2 /WX- /diagnostics:column /Od /Ob0 /D \_MBCS /D WIN32 /D \_WINDOWS /D “C\_HAS\_WARNING-Wshadow” /D “CMAKE\_INTDIR=“Debug”” /Gm- /RTC1 /MDd /GS /fp:precise /Zc:wchar\_t /Zc:forScope /Zc:inline /Fo"cmTC\_fc650.dir\Debug\" /Fd"cmTC\_fc650.dir\Debug\vc142.pdb" /external:W2 /Gd /TC /errorReport:queue /bigobj -Wshadow “C:\D\S4R\Slicer-build\CMakeFiles\CMakeTmp\src.c”

cl : 명령줄 error D8021: ‘/Wshadow’ 숫자 인수가 잘못되었습니다. [C:\D\S4R\Slicer-build\CMakeFiles\CMakeTmp\cmTC\_fc650.vcxproj]

Source file was:  
int main(void) { return 0; }  
Performing C SOURCE FILE Test C\_HAS\_WARNING-Wunused failed with the following output:  
Change Dir: C:/D/S4R/Slicer-build/CMakeFiles/CMakeTmp

Run Build Command(s):C:/Program Files (x86)/Microsoft Visual Studio/2019/Community/MSBuild/Current/Bin/MSBuild.exe cmTC\_6a0c1.vcxproj /p:Configuration=Debug /p:Platform=x64 /p:VisualStudioVersion=16.0 /v:m && .NET Framework용 Microsoft (R) Build Engine 버전 16.11.0+0538acc04

Copyright (C) Microsoft Corporation. All rights reserved.

Microsoft (R) C/C++ 최적화 컴파일러 버전 19.29.30133(x64)

Copyright (c) Microsoft Corporation. All rights reserved.

cl /c /Zi /W2 /WX- /diagnostics:column /Od /Ob0 /D \_MBCS /D WIN32 /D \_WINDOWS /D “C\_HAS\_WARNING-Wunused” /D “CMAKE\_INTDIR=“Debug”” /Gm- /RTC1 /MDd /GS /fp:precise /Zc:wchar\_t /Zc:forScope /Zc:inline /Fo"cmTC\_6a0c1.dir\Debug\" /Fd"cmTC\_6a0c1.dir\Debug\vc142.pdb" /external:W2 /Gd /TC /errorReport:queue /bigobj -Wunused “C:\D\S4R\Slicer-build\CMakeFiles\CMakeTmp\src.c”

cl : 명령줄 error D8021: ‘/Wunused’ 숫자 인수가 잘못되었습니다. [C:\D\S4R\Slicer-build\CMakeFiles\CMakeTmp\cmTC\_6a0c1.vcxproj]

Source file was:  
int main(void) { return 0; }  
Performing C SOURCE FILE Test C\_HAS\_WARNING-Wwrite-strings failed with the following output:  
Change Dir: C:/D/S4R/Slicer-build/CMakeFiles/CMakeTmp

Run Build Command(s):C:/Program Files (x86)/Microsoft Visual Studio/2019/Community/MSBuild/Current/Bin/MSBuild.exe cmTC\_7fccd.vcxproj /p:Configuration=Debug /p:Platform=x64 /p:VisualStudioVersion=16.0 /v:m && .NET Framework용 Microsoft (R) Build Engine 버전 16.11.0+0538acc04

Copyright (C) Microsoft Corporation. All rights reserved.

Microsoft (R) C/C++ 최적화 컴파일러 버전 19.29.30133(x64)

Copyright (c) Microsoft Corporation. All rights reserved.

cl /c /Zi /W2 /WX- /diagnostics:column /Od /Ob0 /D \_MBCS /D WIN32 /D \_WINDOWS /D “C\_HAS\_WARNING-Wwrite-strings” /D “CMAKE\_INTDIR=“Debug”” /Gm- /RTC1 /MDd /GS /fp:precise /Zc:wchar\_t /Zc:forScope /Zc:inline /Fo"cmTC\_7fccd.dir\Debug\" /Fd"cmTC\_7fccd.dir\Debug\vc142.pdb" /external:W2 /Gd /TC /errorReport:queue /bigobj -Wwrite-strings “C:\D\S4R\Slicer-build\CMakeFiles\CMakeTmp\src.c”

cl : 명령줄 error D8021: ‘/Wwrite-strings’ 숫자 인수가 잘못되었습니다. [C:\D\S4R\Slicer-build\CMakeFiles\CMakeTmp\cmTC\_7fccd.vcxproj]

Source file was:  
int main(void) { return 0; }  
Performing C SOURCE FILE Test C\_HAS\_WARNING-funit-at-a-time failed with the following output:  
Change Dir: C:/D/S4R/Slicer-build/CMakeFiles/CMakeTmp

Run Build Command(s):C:/Program Files (x86)/Microsoft Visual Studio/2019/Community/MSBuild/Current/Bin/MSBuild.exe cmTC\_f1d32.vcxproj /p:Configuration=Debug /p:Platform=x64 /p:VisualStudioVersion=16.0 /v:m && .NET Framework용 Microsoft (R) Build Engine 버전 16.11.0+0538acc04

Copyright (C) Microsoft Corporation. All rights reserved.

Microsoft (R) C/C++ 최적화 컴파일러 버전 19.29.30133(x64)

Copyright (c) Microsoft Corporation. All rights reserved.

src.c

cl /c /Zi /W2 /WX- /diagnostics:column /Od /Ob0 /D \_MBCS /D WIN32 /D \_WINDOWS /D “C\_HAS\_WARNING-funit-at-a-time” /D “CMAKE\_INTDIR=“Debug”” /Gm- /RTC1 /MDd /GS /fp:precise /Zc:wchar\_t /Zc:forScope /Zc:inline /Fo"cmTC\_f1d32.dir\Debug\" /Fd"cmTC\_f1d32.dir\Debug\vc142.pdb" /external:W2 /Gd /TC /errorReport:queue /bigobj -funit-at-a-time “C:\D\S4R\Slicer-build\CMakeFiles\CMakeTmp\src.c”

cl : 명령줄 warning D9002: 알 수 없는 ‘-funit-at-a-time’ 옵션을 무시합니다. [C:\D\S4R\Slicer-build\CMakeFiles\CMakeTmp\cmTC\_f1d32.vcxproj]

cmTC\_f1d32.vcxproj → C:\D\S4R\Slicer-build\CMakeFiles\CMakeTmp\Debug\cmTC\_f1d32.exe

Source file was:  
int main(void) { return 0; }  
Performing C SOURCE FILE Test C\_HAS\_WARNING-Wno-strict-overflow failed with the following output:  
Change Dir: C:/D/S4R/Slicer-build/CMakeFiles/CMakeTmp

Run Build Command(s):C:/Program Files (x86)/Microsoft Visual Studio/2019/Community/MSBuild/Current/Bin/MSBuild.exe cmTC\_f1123.vcxproj /p:Configuration=Debug /p:Platform=x64 /p:VisualStudioVersion=16.0 /v:m && .NET Framework용 Microsoft (R) Build Engine 버전 16.11.0+0538acc04

Copyright (C) Microsoft Corporation. All rights reserved.

Microsoft (R) C/C++ 최적화 컴파일러 버전 19.29.30133(x64)

Copyright (c) Microsoft Corporation. All rights reserved.

cl /c /Zi /W2 /WX- /diagnostics:column /Od /Ob0 /D \_MBCS /D WIN32 /D \_WINDOWS /D “C\_HAS\_WARNING-Wno-strict-overflow” /D “CMAKE\_INTDIR=“Debug”” /Gm- /RTC1 /MDd /GS /fp:precise /Zc:wchar\_t /Zc:forScope /Zc:inline /Fo"cmTC\_f1123.dir\Debug\" /Fd"cmTC\_f1123.dir\Debug\vc142.pdb" /external:W2 /Gd /TC /errorReport:queue /bigobj -Wno-strict-overflow “C:\D\S4R\Slicer-build\CMakeFiles\CMakeTmp\src.c”

cl : 명령줄 error D8021: ‘/Wno-strict-overflow’ 숫자 인수가 잘못되었습니다. [C:\D\S4R\Slicer-build\CMakeFiles\CMakeTmp\cmTC\_f1123.vcxproj]

Source file was:  
int main(void) { return 0; }  
Performing C++ SOURCE FILE Test CXX\_HAS\_WARNING-Wno-long-double failed with the following output:  
Change Dir: C:/D/S4R/Slicer-build/CMakeFiles/CMakeTmp

Run Build Command(s):C:/Program Files (x86)/Microsoft Visual Studio/2019/Community/MSBuild/Current/Bin/MSBuild.exe cmTC\_a7674.vcxproj /p:Configuration=Debug /p:Platform=x64 /p:VisualStudioVersion=16.0 /v:m && .NET Framework용 Microsoft (R) Build Engine 버전 16.11.0+0538acc04

Copyright (C) Microsoft Corporation. All rights reserved.

Microsoft (R) C/C++ 최적화 컴파일러 버전 19.29.30133(x64)

Copyright (c) Microsoft Corporation. All rights reserved.

cl /c /Zi /W2 /WX- /diagnostics:column /Od /Ob0 /D \_MBCS /D WIN32 /D \_WINDOWS /D “CXX\_HAS\_WARNING-Wno-long-double” /D “CMAKE\_INTDIR=“Debug”” /Gm- /EHsc /RTC1 /MDd /GS /fp:precise /Zc:wchar\_t /Zc:forScope /Zc:inline /GR /Fo"cmTC\_a7674.dir\Debug\" /Fd"cmTC\_a7674.dir\Debug\vc142.pdb" /external:W2 /Gd /TP /errorReport:queue /bigobj /bigobj -Wno-long-double “C:\D\S4R\Slicer-build\CMakeFiles\CMakeTmp\src.cxx”

cl : 명령줄 error D8021: ‘/Wno-long-double’ 숫자 인수가 잘못되었습니다. [C:\D\S4R\Slicer-build\CMakeFiles\CMakeTmp\cmTC\_a7674.vcxproj]

Source file was:  
int main() { return 0;}  
Performing C++ SOURCE FILE Test CXX\_HAS\_WARNING-Wcast-align failed with the following output:  
Change Dir: C:/D/S4R/Slicer-build/CMakeFiles/CMakeTmp

Run Build Command(s):C:/Program Files (x86)/Microsoft Visual Studio/2019/Community/MSBuild/Current/Bin/MSBuild.exe cmTC\_1a208.vcxproj /p:Configuration=Debug /p:Platform=x64 /p:VisualStudioVersion=16.0 /v:m && .NET Framework용 Microsoft (R) Build Engine 버전 16.11.0+0538acc04

Copyright (C) Microsoft Corporation. All rights reserved.

Microsoft (R) C/C++ 최적화 컴파일러 버전 19.29.30133(x64)

Copyright (c) Microsoft Corporation. All rights reserved.

cl /c /Zi /W2 /WX- /diagnostics:column /Od /Ob0 /D \_MBCS /D WIN32 /D \_WINDOWS /D “CXX\_HAS\_WARNING-Wcast-align” /D “CMAKE\_INTDIR=“Debug”” /Gm- /EHsc /RTC1 /MDd /GS /fp:precise /Zc:wchar\_t /Zc:forScope /Zc:inline /GR /Fo"cmTC\_1a208.dir\Debug\" /Fd"cmTC\_1a208.dir\Debug\vc142.pdb" /external:W2 /Gd /TP /errorReport:queue /bigobj /bigobj -Wcast-align “C:\D\S4R\Slicer-build\CMakeFiles\CMakeTmp\src.cxx”

cl : 명령줄 error D8021: ‘/Wcast-align’ 숫자 인수가 잘못되었습니다. [C:\D\S4R\Slicer-build\CMakeFiles\CMakeTmp\cmTC\_1a208.vcxproj]

Source file was:  
int main() { return 0;}  
Performing C++ SOURCE FILE Test CXX\_HAS\_WARNING-Wdisabled-optimization failed with the following output:  
Change Dir: C:/D/S4R/Slicer-build/CMakeFiles/CMakeTmp

Run Build Command(s):C:/Program Files (x86)/Microsoft Visual Studio/2019/Community/MSBuild/Current/Bin/MSBuild.exe cmTC\_7a08f.vcxproj /p:Configuration=Debug /p:Platform=x64 /p:VisualStudioVersion=16.0 /v:m && .NET Framework용 Microsoft (R) Build Engine 버전 16.11.0+0538acc04

Copyright (C) Microsoft Corporation. All rights reserved.

Microsoft (R) C/C++ 최적화 컴파일러 버전 19.29.30133(x64)

Copyright (c) Microsoft Corporation. All rights reserved.

cl /c /Zi /W2 /WX- /diagnostics:column /Od /Ob0 /D \_MBCS /D WIN32 /D \_WINDOWS /D “CXX\_HAS\_WARNING-Wdisabled-optimization” /D “CMAKE\_INTDIR=“Debug”” /Gm- /EHsc /RTC1 /MDd /GS /fp:precise /Zc:wchar\_t /Zc:forScope /Zc:inline /GR /Fo"cmTC\_7a08f.dir\Debug\" /Fd"cmTC\_7a08f.dir\Debug\vc142.pdb" /external:W2 /Gd /TP /errorReport:queue /bigobj /bigobj -Wdisabled-optimization “C:\D\S4R\Slicer-build\CMakeFiles\CMakeTmp\src.cxx”

cl : 명령줄 error D8021: ‘/Wdisabled-optimization’ 숫자 인수가 잘못되었습니다. [C:\D\S4R\Slicer-build\CMakeFiles\CMakeTmp\cmTC\_7a08f.vcxproj]

Source file was:  
int main() { return 0;}  
Performing C++ SOURCE FILE Test CXX\_HAS\_WARNING-Wextra failed with the following output:  
Change Dir: C:/D/S4R/Slicer-build/CMakeFiles/CMakeTmp

Run Build Command(s):C:/Program Files (x86)/Microsoft Visual Studio/2019/Community/MSBuild/Current/Bin/MSBuild.exe cmTC\_160ad.vcxproj /p:Configuration=Debug /p:Platform=x64 /p:VisualStudioVersion=16.0 /v:m && .NET Framework용 Microsoft (R) Build Engine 버전 16.11.0+0538acc04

Copyright (C) Microsoft Corporation. All rights reserved.

Microsoft (R) C/C++ 최적화 컴파일러 버전 19.29.30133(x64)

Copyright (c) Microsoft Corporation. All rights reserved.

cl /c /Zi /W2 /WX- /diagnostics:column /Od /Ob0 /D \_MBCS /D WIN32 /D \_WINDOWS /D “CXX\_HAS\_WARNING-Wextra” /D “CMAKE\_INTDIR=“Debug”” /Gm- /EHsc /RTC1 /MDd /GS /fp:precise /Zc:wchar\_t /Zc:forScope /Zc:inline /GR /Fo"cmTC\_160ad.dir\Debug\" /Fd"cmTC\_160ad.dir\Debug\vc142.pdb" /external:W2 /Gd /TP /errorReport:queue /bigobj /bigobj -Wextra “C:\D\S4R\Slicer-build\CMakeFiles\CMakeTmp\src.cxx”

cl : 명령줄 error D8021: ‘/Wextra’ 숫자 인수가 잘못되었습니다. [C:\D\S4R\Slicer-build\CMakeFiles\CMakeTmp\cmTC\_160ad.vcxproj]

Source file was:  
int main() { return 0;}  
Performing C++ SOURCE FILE Test CXX\_HAS\_WARNING-Wformat\_2 failed with the following output:  
Change Dir: C:/D/S4R/Slicer-build/CMakeFiles/CMakeTmp

Run Build Command(s):C:/Program Files (x86)/Microsoft Visual Studio/2019/Community/MSBuild/Current/Bin/MSBuild.exe cmTC\_e67af.vcxproj /p:Configuration=Debug /p:Platform=x64 /p:VisualStudioVersion=16.0 /v:m && .NET Framework용 Microsoft (R) Build Engine 버전 16.11.0+0538acc04

Copyright (C) Microsoft Corporation. All rights reserved.

Microsoft (R) C/C++ 최적화 컴파일러 버전 19.29.30133(x64)

Copyright (c) Microsoft Corporation. All rights reserved.

cl /c /Zi /W2 /WX- /diagnostics:column /Od /Ob0 /D \_MBCS /D WIN32 /D \_WINDOWS /D “CXX\_HAS\_WARNING-Wformat\_2” /D “CMAKE\_INTDIR=“Debug”” /Gm- /EHsc /RTC1 /MDd /GS /fp:precise /Zc:wchar\_t /Zc:forScope /Zc:inline /GR /Fo"cmTC\_e67af.dir\Debug\" /Fd"cmTC\_e67af.dir\Debug\vc142.pdb" /external:W2 /Gd /TP /errorReport:queue /bigobj /bigobj -Wformat=2 “C:\D\S4R\Slicer-build\CMakeFiles\CMakeTmp\src.cxx”

cl : 명령줄 error D8021: ‘/Wformat=2’ 숫자 인수가 잘못되었습니다. [C:\D\S4R\Slicer-build\CMakeFiles\CMakeTmp\cmTC\_e67af.vcxproj]

Source file was:  
int main() { return 0;}  
Performing C++ SOURCE FILE Test CXX\_HAS\_WARNING-Winvalid-pch failed with the following output:  
Change Dir: C:/D/S4R/Slicer-build/CMakeFiles/CMakeTmp

Run Build Command(s):C:/Program Files (x86)/Microsoft Visual Studio/2019/Community/MSBuild/Current/Bin/MSBuild.exe cmTC\_bde73.vcxproj /p:Configuration=Debug /p:Platform=x64 /p:VisualStudioVersion=16.0 /v:m && .NET Framework용 Microsoft (R) Build Engine 버전 16.11.0+0538acc04

Copyright (C) Microsoft Corporation. All rights reserved.

Microsoft (R) C/C++ 최적화 컴파일러 버전 19.29.30133(x64)

Copyright (c) Microsoft Corporation. All rights reserved.

cl /c /Zi /W2 /WX- /diagnostics:column /Od /Ob0 /D \_MBCS /D WIN32 /D \_WINDOWS /D “CXX\_HAS\_WARNING-Winvalid-pch” /D “CMAKE\_INTDIR=“Debug”” /Gm- /EHsc /RTC1 /MDd /GS /fp:precise /Zc:wchar\_t /Zc:forScope /Zc:inline /GR /Fo"cmTC\_bde73.dir\Debug\" /Fd"cmTC\_bde73.dir\Debug\vc142.pdb" /external:W2 /Gd /TP /errorReport:queue /bigobj /bigobj -Winvalid-pch “C:\D\S4R\Slicer-build\CMakeFiles\CMakeTmp\src.cxx”

cl : 명령줄 error D8021: ‘/Winvalid-pch’ 숫자 인수가 잘못되었습니다. [C:\D\S4R\Slicer-build\CMakeFiles\CMakeTmp\cmTC\_bde73.vcxproj]

Source file was:  
int main() { return 0;}  
Performing C++ SOURCE FILE Test CXX\_HAS\_WARNING-Wno-format-nonliteral failed with the following output:  
Change Dir: C:/D/S4R/Slicer-build/CMakeFiles/CMakeTmp

Run Build Command(s):C:/Program Files (x86)/Microsoft Visual Studio/2019/Community/MSBuild/Current/Bin/MSBuild.exe cmTC\_4fec3.vcxproj /p:Configuration=Debug /p:Platform=x64 /p:VisualStudioVersion=16.0 /v:m && .NET Framework용 Microsoft (R) Build Engine 버전 16.11.0+0538acc04

Copyright (C) Microsoft Corporation. All rights reserved.

Microsoft (R) C/C++ 최적화 컴파일러 버전 19.29.30133(x64)

Copyright (c) Microsoft Corporation. All rights reserved.

cl /c /Zi /W2 /WX- /diagnostics:column /Od /Ob0 /D \_MBCS /D WIN32 /D \_WINDOWS /D “CXX\_HAS\_WARNING-Wno-format-nonliteral” /D “CMAKE\_INTDIR=“Debug”” /Gm- /EHsc /RTC1 /MDd /GS /fp:precise /Zc:wchar\_t /Zc:forScope /Zc:inline /GR /Fo"cmTC\_4fec3.dir\Debug\" /Fd"cmTC\_4fec3.dir\Debug\vc142.pdb" /external:W2 /Gd /TP /errorReport:queue /bigobj /bigobj -Wno-format-nonliteral “C:\D\S4R\Slicer-build\CMakeFiles\CMakeTmp\src.cxx”

cl : 명령줄 error D8021: ‘/Wno-format-nonliteral’ 숫자 인수가 잘못되었습니다. [C:\D\S4R\Slicer-build\CMakeFiles\CMakeTmp\cmTC\_4fec3.vcxproj]

Source file was:  
int main() { return 0;}  
Performing C++ SOURCE FILE Test CXX\_HAS\_WARNING-Wpointer-arith failed with the following output:  
Change Dir: C:/D/S4R/Slicer-build/CMakeFiles/CMakeTmp

Run Build Command(s):C:/Program Files (x86)/Microsoft Visual Studio/2019/Community/MSBuild/Current/Bin/MSBuild.exe cmTC\_31f09.vcxproj /p:Configuration=Debug /p:Platform=x64 /p:VisualStudioVersion=16.0 /v:m && .NET Framework용 Microsoft (R) Build Engine 버전 16.11.0+0538acc04

Copyright (C) Microsoft Corporation. All rights reserved.

Microsoft (R) C/C++ 최적화 컴파일러 버전 19.29.30133(x64)

Copyright (c) Microsoft Corporation. All rights reserved.

cl /c /Zi /W2 /WX- /diagnostics:column /Od /Ob0 /D \_MBCS /D WIN32 /D \_WINDOWS /D “CXX\_HAS\_WARNING-Wpointer-arith” /D “CMAKE\_INTDIR=“Debug”” /Gm- /EHsc /RTC1 /MDd /GS /fp:precise /Zc:wchar\_t /Zc:forScope /Zc:inline /GR /Fo"cmTC\_31f09.dir\Debug\" /Fd"cmTC\_31f09.dir\Debug\vc142.pdb" /external:W2 /Gd /TP /errorReport:queue /bigobj /bigobj -Wpointer-arith “C:\D\S4R\Slicer-build\CMakeFiles\CMakeTmp\src.cxx”

cl : 명령줄 error D8021: ‘/Wpointer-arith’ 숫자 인수가 잘못되었습니다. [C:\D\S4R\Slicer-build\CMakeFiles\CMakeTmp\cmTC\_31f09.vcxproj]

Source file was:  
int main() { return 0;}  
Performing C++ SOURCE FILE Test CXX\_HAS\_WARNING-Wshadow failed with the following output:  
Change Dir: C:/D/S4R/Slicer-build/CMakeFiles/CMakeTmp

Run Build Command(s):C:/Program Files (x86)/Microsoft Visual Studio/2019/Community/MSBuild/Current/Bin/MSBuild.exe cmTC\_7371a.vcxproj /p:Configuration=Debug /p:Platform=x64 /p:VisualStudioVersion=16.0 /v:m && .NET Framework용 Microsoft (R) Build Engine 버전 16.11.0+0538acc04

Copyright (C) Microsoft Corporation. All rights reserved.

Microsoft (R) C/C++ 최적화 컴파일러 버전 19.29.30133(x64)

Copyright (c) Microsoft Corporation. All rights reserved.

cl /c /Zi /W2 /WX- /diagnostics:column /Od /Ob0 /D \_MBCS /D WIN32 /D \_WINDOWS /D “CXX\_HAS\_WARNING-Wshadow” /D “CMAKE\_INTDIR=“Debug”” /Gm- /EHsc /RTC1 /MDd /GS /fp:precise /Zc:wchar\_t /Zc:forScope /Zc:inline /GR /Fo"cmTC\_7371a.dir\Debug\" /Fd"cmTC\_7371a.dir\Debug\vc142.pdb" /external:W2 /Gd /TP /errorReport:queue /bigobj /bigobj -Wshadow “C:\D\S4R\Slicer-build\CMakeFiles\CMakeTmp\src.cxx”

cl : 명령줄 error D8021: ‘/Wshadow’ 숫자 인수가 잘못되었습니다. [C:\D\S4R\Slicer-build\CMakeFiles\CMakeTmp\cmTC\_7371a.vcxproj]

Source file was:  
int main() { return 0;}  
Performing C++ SOURCE FILE Test CXX\_HAS\_WARNING-Wunused failed with the following output:  
Change Dir: C:/D/S4R/Slicer-build/CMakeFiles/CMakeTmp

Run Build Command(s):C:/Program Files (x86)/Microsoft Visual Studio/2019/Community/MSBuild/Current/Bin/MSBuild.exe cmTC\_11ebd.vcxproj /p:Configuration=Debug /p:Platform=x64 /p:VisualStudioVersion=16.0 /v:m && .NET Framework용 Microsoft (R) Build Engine 버전 16.11.0+0538acc04

Copyright (C) Microsoft Corporation. All rights reserved.

Microsoft (R) C/C++ 최적화 컴파일러 버전 19.29.30133(x64)

Copyright (c) Microsoft Corporation. All rights reserved.

cl /c /Zi /W2 /WX- /diagnostics:column /Od /Ob0 /D \_MBCS /D WIN32 /D \_WINDOWS /D “CXX\_HAS\_WARNING-Wunused” /D “CMAKE\_INTDIR=“Debug”” /Gm- /EHsc /RTC1 /MDd /GS /fp:precise /Zc:wchar\_t /Zc:forScope /Zc:inline /GR /Fo"cmTC\_11ebd.dir\Debug\" /Fd"cmTC\_11ebd.dir\Debug\vc142.pdb" /external:W2 /Gd /TP /errorReport:queue /bigobj /bigobj -Wunused “C:\D\S4R\Slicer-build\CMakeFiles\CMakeTmp\src.cxx”

cl : 명령줄 error D8021: ‘/Wunused’ 숫자 인수가 잘못되었습니다. [C:\D\S4R\Slicer-build\CMakeFiles\CMakeTmp\cmTC\_11ebd.vcxproj]

Source file was:  
int main() { return 0;}  
Performing C++ SOURCE FILE Test CXX\_HAS\_WARNING-Wwrite-strings failed with the following output:  
Change Dir: C:/D/S4R/Slicer-build/CMakeFiles/CMakeTmp

Run Build Command(s):C:/Program Files (x86)/Microsoft Visual Studio/2019/Community/MSBuild/Current/Bin/MSBuild.exe cmTC\_f1cf0.vcxproj /p:Configuration=Debug /p:Platform=x64 /p:VisualStudioVersion=16.0 /v:m && .NET Framework용 Microsoft (R) Build Engine 버전 16.11.0+0538acc04

Copyright (C) Microsoft Corporation. All rights reserved.

Microsoft (R) C/C++ 최적화 컴파일러 버전 19.29.30133(x64)

Copyright (c) Microsoft Corporation. All rights reserved.

cl /c /Zi /W2 /WX- /diagnostics:column /Od /Ob0 /D \_MBCS /D WIN32 /D \_WINDOWS /D “CXX\_HAS\_WARNING-Wwrite-strings” /D “CMAKE\_INTDIR=“Debug”” /Gm- /EHsc /RTC1 /MDd /GS /fp:precise /Zc:wchar\_t /Zc:forScope /Zc:inline /GR /Fo"cmTC\_f1cf0.dir\Debug\" /Fd"cmTC\_f1cf0.dir\Debug\vc142.pdb" /external:W2 /Gd /TP /errorReport:queue /bigobj /bigobj -Wwrite-strings “C:\D\S4R\Slicer-build\CMakeFiles\CMakeTmp\src.cxx”

cl : 명령줄 error D8021: ‘/Wwrite-strings’ 숫자 인수가 잘못되었습니다. [C:\D\S4R\Slicer-build\CMakeFiles\CMakeTmp\cmTC\_f1cf0.vcxproj]

Source file was:  
int main() { return 0;}  
Performing C++ SOURCE FILE Test CXX\_HAS\_WARNING-funit-at-a-time failed with the following output:  
Change Dir: C:/D/S4R/Slicer-build/CMakeFiles/CMakeTmp

Run Build Command(s):C:/Program Files (x86)/Microsoft Visual Studio/2019/Community/MSBuild/Current/Bin/MSBuild.exe cmTC\_d0faa.vcxproj /p:Configuration=Debug /p:Platform=x64 /p:VisualStudioVersion=16.0 /v:m && .NET Framework용 Microsoft (R) Build Engine 버전 16.11.0+0538acc04

Copyright (C) Microsoft Corporation. All rights reserved.

Microsoft (R) C/C++ 최적화 컴파일러 버전 19.29.30133(x64)

Copyright (c) Microsoft Corporation. All rights reserved.

src.cxx

cl /c /Zi /W2 /WX- /diagnostics:column /Od /Ob0 /D \_MBCS /D WIN32 /D \_WINDOWS /D “CXX\_HAS\_WARNING-funit-at-a-time” /D “CMAKE\_INTDIR=“Debug”” /Gm- /EHsc /RTC1 /MDd /GS /fp:precise /Zc:wchar\_t /Zc:forScope /Zc:inline /GR /Fo"cmTC\_d0faa.dir\Debug\" /Fd"cmTC\_d0faa.dir\Debug\vc142.pdb" /external:W2 /Gd /TP /errorReport:queue /bigobj /bigobj -funit-at-a-time “C:\D\S4R\Slicer-build\CMakeFiles\CMakeTmp\src.cxx”

cl : 명령줄 warning D9002: 알 수 없는 ‘-funit-at-a-time’ 옵션을 무시합니다. [C:\D\S4R\Slicer-build\CMakeFiles\CMakeTmp\cmTC\_d0faa.vcxproj]

cmTC\_d0faa.vcxproj → C:\D\S4R\Slicer-build\CMakeFiles\CMakeTmp\Debug\cmTC\_d0faa.exe

Source file was:  
int main() { return 0;}  
Performing C++ SOURCE FILE Test CXX\_HAS\_WARNING-Wno-strict-overflow failed with the following output:  
Change Dir: C:/D/S4R/Slicer-build/CMakeFiles/CMakeTmp

Run Build Command(s):C:/Program Files (x86)/Microsoft Visual Studio/2019/Community/MSBuild/Current/Bin/MSBuild.exe cmTC\_c1891.vcxproj /p:Configuration=Debug /p:Platform=x64 /p:VisualStudioVersion=16.0 /v:m && .NET Framework용 Microsoft (R) Build Engine 버전 16.11.0+0538acc04

Copyright (C) Microsoft Corporation. All rights reserved.

Microsoft (R) C/C++ 최적화 컴파일러 버전 19.29.30133(x64)

Copyright (c) Microsoft Corporation. All rights reserved.

cl /c /Zi /W2 /WX- /diagnostics:column /Od /Ob0 /D \_MBCS /D WIN32 /D \_WINDOWS /D “CXX\_HAS\_WARNING-Wno-strict-overflow” /D “CMAKE\_INTDIR=“Debug”” /Gm- /EHsc /RTC1 /MDd /GS /fp:precise /Zc:wchar\_t /Zc:forScope /Zc:inline /GR /Fo"cmTC\_c1891.dir\Debug\" /Fd"cmTC\_c1891.dir\Debug\vc142.pdb" /external:W2 /Gd /TP /errorReport:queue /bigobj /bigobj -Wno-strict-overflow “C:\D\S4R\Slicer-build\CMakeFiles\CMakeTmp\src.cxx”

cl : 명령줄 error D8021: ‘/Wno-strict-overflow’ 숫자 인수가 잘못되었습니다. [C:\D\S4R\Slicer-build\CMakeFiles\CMakeTmp\cmTC\_c1891.vcxproj]

Source file was:  
int main() { return 0;}  
Performing C++ SOURCE FILE Test CXX\_HAS\_WARNING-Wno-deprecated failed with the following output:  
Change Dir: C:/D/S4R/Slicer-build/CMakeFiles/CMakeTmp

Run Build Command(s):C:/Program Files (x86)/Microsoft Visual Studio/2019/Community/MSBuild/Current/Bin/MSBuild.exe cmTC\_164e8.vcxproj /p:Configuration=Debug /p:Platform=x64 /p:VisualStudioVersion=16.0 /v:m && .NET Framework용 Microsoft (R) Build Engine 버전 16.11.0+0538acc04

Copyright (C) Microsoft Corporation. All rights reserved.

Microsoft (R) C/C++ 최적화 컴파일러 버전 19.29.30133(x64)

Copyright (c) Microsoft Corporation. All rights reserved.

cl /c /Zi /W2 /WX- /diagnostics:column /Od /Ob0 /D \_MBCS /D WIN32 /D \_WINDOWS /D “CXX\_HAS\_WARNING-Wno-deprecated” /D “CMAKE\_INTDIR=“Debug”” /Gm- /EHsc /RTC1 /MDd /GS /fp:precise /Zc:wchar\_t /Zc:forScope /Zc:inline /GR /Fo"cmTC\_164e8.dir\Debug\" /Fd"cmTC\_164e8.dir\Debug\vc142.pdb" /external:W2 /Gd /TP /errorReport:queue /bigobj /bigobj -Wno-deprecated “C:\D\S4R\Slicer-build\CMakeFiles\CMakeTmp\src.cxx”

cl : 명령줄 error D8021: ‘/Wno-deprecated’ 숫자 인수가 잘못되었습니다. [C:\D\S4R\Slicer-build\CMakeFiles\CMakeTmp\cmTC\_164e8.vcxproj]

Source file was:  
int main() { return 0;}  
Performing C++ SOURCE FILE Test CXX\_HAS\_WARNING-Wno-invalid-offsetof failed with the following output:  
Change Dir: C:/D/S4R/Slicer-build/CMakeFiles/CMakeTmp

Run Build Command(s):C:/Program Files (x86)/Microsoft Visual Studio/2019/Community/MSBuild/Current/Bin/MSBuild.exe cmTC\_8685f.vcxproj /p:Configuration=Debug /p:Platform=x64 /p:VisualStudioVersion=16.0 /v:m && .NET Framework용 Microsoft (R) Build Engine 버전 16.11.0+0538acc04

Copyright (C) Microsoft Corporation. All rights reserved.

Microsoft (R) C/C++ 최적화 컴파일러 버전 19.29.30133(x64)

Copyright (c) Microsoft Corporation. All rights reserved.

cl /c /Zi /W2 /WX- /diagnostics:column /Od /Ob0 /D \_MBCS /D WIN32 /D \_WINDOWS /D “CXX\_HAS\_WARNING-Wno-invalid-offsetof” /D “CMAKE\_INTDIR=“Debug”” /Gm- /EHsc /RTC1 /MDd /GS /fp:precise /Zc:wchar\_t /Zc:forScope /Zc:inline /GR /Fo"cmTC\_8685f.dir\Debug\" /Fd"cmTC\_8685f.dir\Debug\vc142.pdb" /external:W2 /Gd /TP /errorReport:queue /bigobj /bigobj -Wno-invalid-offsetof “C:\D\S4R\Slicer-build\CMakeFiles\CMakeTmp\src.cxx”

cl : 명령줄 error D8021: ‘/Wno-invalid-offsetof’ 숫자 인수가 잘못되었습니다. [C:\D\S4R\Slicer-build\CMakeFiles\CMakeTmp\cmTC\_8685f.vcxproj]

Source file was:  
int main() { return 0;}  
Performing C++ SOURCE FILE Test CXX\_HAS\_WARNING-Wno-undefined-var-template failed with the following output:  
Change Dir: C:/D/S4R/Slicer-build/CMakeFiles/CMakeTmp

Run Build Command(s):C:/Program Files (x86)/Microsoft Visual Studio/2019/Community/MSBuild/Current/Bin/MSBuild.exe cmTC\_e43b0.vcxproj /p:Configuration=Debug /p:Platform=x64 /p:VisualStudioVersion=16.0 /v:m && .NET Framework용 Microsoft (R) Build Engine 버전 16.11.0+0538acc04

Copyright (C) Microsoft Corporation. All rights reserved.

Microsoft (R) C/C++ 최적화 컴파일러 버전 19.29.30133(x64)

Copyright (c) Microsoft Corporation. All rights reserved.

cl /c /Zi /W2 /WX- /diagnostics:column /Od /Ob0 /D \_MBCS /D WIN32 /D \_WINDOWS /D “CXX\_HAS\_WARNING-Wno-undefined-var-template” /D “CMAKE\_INTDIR=“Debug”” /Gm- /EHsc /RTC1 /MDd /GS /fp:precise /Zc:wchar\_t /Zc:forScope /Zc:inline /GR /Fo"cmTC\_e43b0.dir\Debug\" /Fd"cmTC\_e43b0.dir\Debug\vc142.pdb" /external:W2 /Gd /TP /errorReport:queue /bigobj /bigobj -Wno-undefined-var-template “C:\D\S4R\Slicer-build\CMakeFiles\CMakeTmp\src.cxx”

cl : 명령줄 error D8021: ‘/Wno-undefined-var-template’ 숫자 인수가 잘못되었습니다. [C:\D\S4R\Slicer-build\CMakeFiles\CMakeTmp\cmTC\_e43b0.vcxproj]

Source file was:  
int main() { return 0;}  
Performing C++ SOURCE FILE Test CXX\_HAS\_WARNING-Woverloaded-virtual failed with the following output:  
Change Dir: C:/D/S4R/Slicer-build/CMakeFiles/CMakeTmp

Run Build Command(s):C:/Program Files (x86)/Microsoft Visual Studio/2019/Community/MSBuild/Current/Bin/MSBuild.exe cmTC\_6d091.vcxproj /p:Configuration=Debug /p:Platform=x64 /p:VisualStudioVersion=16.0 /v:m && .NET Framework용 Microsoft (R) Build Engine 버전 16.11.0+0538acc04

Copyright (C) Microsoft Corporation. All rights reserved.

Microsoft (R) C/C++ 최적화 컴파일러 버전 19.29.30133(x64)

Copyright (c) Microsoft Corporation. All rights reserved.

cl /c /Zi /W2 /WX- /diagnostics:column /Od /Ob0 /D \_MBCS /D WIN32 /D \_WINDOWS /D “CXX\_HAS\_WARNING-Woverloaded-virtual” /D “CMAKE\_INTDIR=“Debug”” /Gm- /EHsc /RTC1 /MDd /GS /fp:precise /Zc:wchar\_t /Zc:forScope /Zc:inline /GR /Fo"cmTC\_6d091.dir\Debug\" /Fd"cmTC\_6d091.dir\Debug\vc142.pdb" /external:W2 /Gd /TP /errorReport:queue /bigobj /bigobj -Woverloaded-virtual “C:\D\S4R\Slicer-build\CMakeFiles\CMakeTmp\src.cxx”

cl : 명령줄 error D8021: ‘/Woverloaded-virtual’ 숫자 인수가 잘못되었습니다. [C:\D\S4R\Slicer-build\CMakeFiles\CMakeTmp\cmTC\_6d091.vcxproj]

Source file was:  
int main() { return 0;}  
Performing C++ SOURCE FILE Test CXX\_HAS\_WARNING-Wstrict-null-sentinel failed with the following output:  
Change Dir: C:/D/S4R/Slicer-build/CMakeFiles/CMakeTmp

Run Build Command(s):C:/Program Files (x86)/Microsoft Visual Studio/2019/Community/MSBuild/Current/Bin/MSBuild.exe cmTC\_b934c.vcxproj /p:Configuration=Debug /p:Platform=x64 /p:VisualStudioVersion=16.0 /v:m && .NET Framework용 Microsoft (R) Build Engine 버전 16.11.0+0538acc04

Copyright (C) Microsoft Corporation. All rights reserved.

Microsoft (R) C/C++ 최적화 컴파일러 버전 19.29.30133(x64)

Copyright (c) Microsoft Corporation. All rights reserved.

cl /c /Zi /W2 /WX- /diagnostics:column /Od /Ob0 /D \_MBCS /D WIN32 /D \_WINDOWS /D “CXX\_HAS\_WARNING-Wstrict-null-sentinel” /D “CMAKE\_INTDIR=“Debug”” /Gm- /EHsc /RTC1 /MDd /GS /fp:precise /Zc:wchar\_t /Zc:forScope /Zc:inline /GR /Fo"cmTC\_b934c.dir\Debug\" /Fd"cmTC\_b934c.dir\Debug\vc142.pdb" /external:W2 /Gd /TP /errorReport:queue /bigobj /bigobj -Wstrict-null-sentinel “C:\D\S4R\Slicer-build\CMakeFiles\CMakeTmp\src.cxx”

cl : 명령줄 error D8021: ‘/Wstrict-null-sentinel’ 숫자 인수가 잘못되었습니다. [C:\D\S4R\Slicer-build\CMakeFiles\CMakeTmp\cmTC\_b934c.vcxproj]

Source file was:  
int main() { return 0;}  
Performing C++ SOURCE FILE Test CXX\_HAS\_DISABLE\_OPTIMIZATION\_FLAG failed with the following output:  
Change Dir: C:/D/S4R/Slicer-build/CMakeFiles/CMakeTmp

Run Build Command(s):C:/Program Files (x86)/Microsoft Visual Studio/2019/Community/MSBuild/Current/Bin/MSBuild.exe cmTC\_4497b.vcxproj /p:Configuration=Debug /p:Platform=x64 /p:VisualStudioVersion=16.0 /v:m && .NET Framework용 Microsoft (R) Build Engine 버전 16.11.0+0538acc04

Copyright (C) Microsoft Corporation. All rights reserved.

Microsoft (R) C/C++ 최적화 컴파일러 버전 19.29.30133(x64)

Copyright (c) Microsoft Corporation. All rights reserved.

src.cxx

cl /c /Zi /W2 /WX- /diagnostics:column /Od /Ob0 /D \_MBCS /D WIN32 /D \_WINDOWS /D CXX\_HAS\_DISABLE\_OPTIMIZATION\_FLAG /D “CMAKE\_INTDIR=“Debug”” /Gm- /EHsc /RTC1 /MDd /GS /fp:precise /Zc:wchar\_t /Zc:forScope /Zc:inline /GR /Fo"cmTC\_4497b.dir\Debug\" /Fd"cmTC\_4497b.dir\Debug\vc142.pdb" /external:W2 /Gd /TP /errorReport:queue /bigobj /bigobj “C:\D\S4R\Slicer-build\CMakeFiles\CMakeTmp\src.cxx”

C:\D\S4R\Slicer-build\CMakeFiles\CMakeTmp\src.cxx(1,1): error C2059: 구문 오류: ‘/’ [C:\D\S4R\Slicer-build\CMakeFiles\CMakeTmp\cmTC\_4497b.vcxproj]

Source file was:  
/Od

---

<div class="post-metadata">

**Author:** ![kookoo9999](https://sea2.discourse-cdn.com/flex002/user_avatar/discourse.slicer.org/kookoo9999/32/12394_2.png) [@kookoo9999](https://discourse.slicer.org/u/kookoo9999)\
**Post date:** [September 23, 2021, 6:14am UTC](https://discourse.slicer.org/t/failed-build-slicer-in-windows10-with-visual-studio-2017-qt-5-10-1/19718/23 "2021-09-23T06:14:39Z")

</div>

C:\D\S4R\slicer-build\CMakeOutput.txt

The system is: Windows - 10.0.19042 - AMD64  
Compiling the C compiler identification source file “CMakeCCompilerId.c” succeeded.  
Compiler: C:/Program Files (x86)/Microsoft Visual Studio/2019/Community/VC/Tools/MSVC/14.29.30133/bin/Hostx64/x64/cl.exe  
Build flags: ;;/DWIN32;/D\_WINDOWS;/W2;  
Id flags:

The output was:  
0  
.NET Framework용 Microsoft (R) Build Engine 버전 16.11.0+0538acc04  
Copyright (C) Microsoft Corporation. All rights reserved.

빌드 시작: 2021-09-23 오후 2:20:03  
1 노드의 “C:\D\S4R\Slicer-build\CMakeFiles\3.21.3\CompilerIdC\CompilerIdC.vcxproj” 프로젝트(기본 대상)입니다.  
PrepareForBuild:  
“Debug” 디렉터리를 만들고 있습니다.  
“Debug\CompilerIdC.tlog” 디렉터리를 만들고 있습니다.  
InitializeBuildStatus:  
“AlwaysCreate"이(가) 지정되었기 때문에 “Debug\CompilerIdC.tlog\unsuccessfulbuild"을(를) 만들고 있습니다.  
ClCompile:  
C:\Program Files (x86)\Microsoft Visual Studio\2019\Community\VC\Tools\MSVC\14.29.30133\bin\HostX64\x64\CL.exe /c /nologo /W0 /WX- /diagnostics:column /Od /D \_MBCS /Gm- /EHsc /RTC1 /MDd /GS /fp:precise /Zc:wchar\_t /Zc:forScope /Zc:inline /Fo"Debug\” /Fd"Debug\vc142.pdb” /external:W0 /Gd /TC /FC /errorReport:queue CMakeCCompilerId.c  
CMakeCCompilerId.c  
Link:  
C:\Program Files (x86)\Microsoft Visual Studio\2019\Community\VC\Tools\MSVC\14.29.30133\bin\HostX64\x64\link.exe /ERRORREPORT:QUEUE /OUT:".\CompilerIdC.exe" /INCREMENTAL:NO /NOLOGO kernel32.lib user32.lib gdi32.lib winspool.lib comdlg32.lib advapi32.lib shell32.lib ole32.lib oleaut32.lib uuid.lib odbc32.lib odbccp32.lib /MANIFEST /MANIFESTUAC:“level=‘asInvoker’ uiAccess=‘false’” /manifest:embed /PDB:".\CompilerIdC.pdb" /SUBSYSTEM:CONSOLE /TLBID:1 /DYNAMICBASE /NXCOMPAT /IMPLIB:".\CompilerIdC.lib" /MACHINE:X64 Debug\CMakeCCompilerId.obj  
CompilerIdC.vcxproj → C:\D\S4R\Slicer-build\CMakeFiles\3.21.3\CompilerIdC\CompilerIdC.exe  
PostBuildEvent:  
for %%i in (cl.exe) do @echo CMAKE\_C\_COMPILER=%%~$PATH:i  
:VCEnd  
CMAKE\_C\_COMPILER=C:\Program Files (x86)\Microsoft Visual Studio\2019\Community\VC\Tools\MSVC\14.29.30133\bin\Hostx64\x64\cl.exe  
FinalizeBuildStatus:  
“Debug\CompilerIdC.tlog\unsuccessfulbuild” 파일을 삭제하고 있습니다.  
"Debug\CompilerIdC.tlog\CompilerIdC.lastbuildstate"에 연결(touching)하고 있습니다.  
“C:\D\S4R\Slicer-build\CMakeFiles\3.21.3\CompilerIdC\CompilerIdC.vcxproj” 프로젝트를 빌드했습니다(기본 대상).

빌드했습니다.  
경고 0개  
오류 0개

경과 시간: 00:00:00.46

Compilation of the C compiler identification source “CMakeCCompilerId.c” produced “CompilerIdC.exe”

Compilation of the C compiler identification source “CMakeCCompilerId.c” produced “CompilerIdC.vcxproj”

The C compiler identification is MSVC, found in “C:/D/S4R/Slicer-build/CMakeFiles/3.21.3/CompilerIdC/CompilerIdC.exe”

Compiling the CXX compiler identification source file “CMakeCXXCompilerId.cpp” succeeded.  
Compiler: C:/Program Files (x86)/Microsoft Visual Studio/2019/Community/VC/Tools/MSVC/14.29.30133/bin/Hostx64/x64/cl.exe  
Build flags: ;;/DWIN32;/D\_WINDOWS;/W2;/GR;/EHsc;  
Id flags:

The output was:  
0  
.NET Framework용 Microsoft (R) Build Engine 버전 16.11.0+0538acc04  
Copyright (C) Microsoft Corporation. All rights reserved.

빌드 시작: 2021-09-23 오후 2:20:03  
1 노드의 “C:\D\S4R\Slicer-build\CMakeFiles\3.21.3\CompilerIdCXX\CompilerIdCXX.vcxproj” 프로젝트(기본 대상)입니다.  
PrepareForBuild:  
“Debug” 디렉터리를 만들고 있습니다.  
“Debug\CompilerIdCXX.tlog” 디렉터리를 만들고 있습니다.  
InitializeBuildStatus:  
“AlwaysCreate"이(가) 지정되었기 때문에 “Debug\CompilerIdCXX.tlog\unsuccessfulbuild"을(를) 만들고 있습니다.  
ClCompile:  
C:\Program Files (x86)\Microsoft Visual Studio\2019\Community\VC\Tools\MSVC\14.29.30133\bin\HostX64\x64\CL.exe /c /nologo /W0 /WX- /diagnostics:column /Od /D \_MBCS /Gm- /EHsc /RTC1 /MDd /GS /fp:precise /Zc:wchar\_t /Zc:forScope /Zc:inline /Fo"Debug\” /Fd"Debug\vc142.pdb” /external:W0 /Gd /TP /FC /errorReport:queue CMakeCXXCompilerId.cpp  
CMakeCXXCompilerId.cpp  
Link:  
C:\Program Files (x86)\Microsoft Visual Studio\2019\Community\VC\Tools\MSVC\14.29.30133\bin\HostX64\x64\link.exe /ERRORREPORT:QUEUE /OUT:".\CompilerIdCXX.exe" /INCREMENTAL:NO /NOLOGO kernel32.lib user32.lib gdi32.lib winspool.lib comdlg32.lib advapi32.lib shell32.lib ole32.lib oleaut32.lib uuid.lib odbc32.lib odbccp32.lib /MANIFEST /MANIFESTUAC:“level=‘asInvoker’ uiAccess=‘false’” /manifest:embed /PDB:".\CompilerIdCXX.pdb" /SUBSYSTEM:CONSOLE /TLBID:1 /DYNAMICBASE /NXCOMPAT /IMPLIB:".\CompilerIdCXX.lib" /MACHINE:X64 Debug\CMakeCXXCompilerId.obj  
CompilerIdCXX.vcxproj → C:\D\S4R\Slicer-build\CMakeFiles\3.21.3\CompilerIdCXX\CompilerIdCXX.exe  
PostBuildEvent:  
for %%i in (cl.exe) do @echo CMAKE\_CXX\_COMPILER=%%~$PATH:i  
:VCEnd  
CMAKE\_CXX\_COMPILER=C:\Program Files (x86)\Microsoft Visual Studio\2019\Community\VC\Tools\MSVC\14.29.30133\bin\Hostx64\x64\cl.exe  
FinalizeBuildStatus:  
“Debug\CompilerIdCXX.tlog\unsuccessfulbuild” 파일을 삭제하고 있습니다.  
"Debug\CompilerIdCXX.tlog\CompilerIdCXX.lastbuildstate"에 연결(touching)하고 있습니다.  
“C:\D\S4R\Slicer-build\CMakeFiles\3.21.3\CompilerIdCXX\CompilerIdCXX.vcxproj” 프로젝트를 빌드했습니다(기본 대상).

빌드했습니다.  
경고 0개  
오류 0개

경과 시간: 00:00:00.48

Compilation of the CXX compiler identification source “CMakeCXXCompilerId.cpp” produced “CompilerIdCXX.exe”

Compilation of the CXX compiler identification source “CMakeCXXCompilerId.cpp” produced “CompilerIdCXX.vcxproj”

The CXX compiler identification is MSVC, found in “C:/D/S4R/Slicer-build/CMakeFiles/3.21.3/CompilerIdCXX/CompilerIdCXX.exe”

Detecting C compiler ABI info compiled with the following output:  
Change Dir: C:/D/S4R/Slicer-build/CMakeFiles/CMakeTmp

Run Build Command(s):C:/Program Files (x86)/Microsoft Visual Studio/2019/Community/MSBuild/Current/Bin/MSBuild.exe cmTC\_88ea8.vcxproj /p:Configuration=Debug /p:Platform=x64 /p:VisualStudioVersion=16.0 /v:m && .NET Framework용 Microsoft (R) Build Engine 버전 16.11.0+0538acc04

Copyright (C) Microsoft Corporation. All rights reserved.

Microsoft (R) C/C++ 최적화 컴파일러 버전 19.29.30133(x64)

Copyright (c) Microsoft Corporation. All rights reserved.

CMakeCCompilerABI.c

cl /c /Zi /W2 /WX- /diagnostics:column /Od /Ob0 /D \_MBCS /D WIN32 /D \_WINDOWS /D “CMAKE\_INTDIR=“Debug”” /Gm- /RTC1 /MDd /GS /fp:precise /Zc:wchar\_t /Zc:forScope /Zc:inline /Fo"cmTC\_88ea8.dir\Debug\" /Fd"cmTC\_88ea8.dir\Debug\vc142.pdb" /external:W2 /Gd /TC /errorReport:queue “C:\Program Files\CMake\share\cmake-3.21\Modules\CMakeCCompilerABI.c”

cmTC\_88ea8.vcxproj → C:\D\S4R\Slicer-build\CMakeFiles\CMakeTmp\Debug\cmTC\_88ea8.exe

Detecting CXX compiler ABI info compiled with the following output:  
Change Dir: C:/D/S4R/Slicer-build/CMakeFiles/CMakeTmp

Run Build Command(s):C:/Program Files (x86)/Microsoft Visual Studio/2019/Community/MSBuild/Current/Bin/MSBuild.exe cmTC\_61cdc.vcxproj /p:Configuration=Debug /p:Platform=x64 /p:VisualStudioVersion=16.0 /v:m && .NET Framework용 Microsoft (R) Build Engine 버전 16.11.0+0538acc04

Copyright (C) Microsoft Corporation. All rights reserved.

Microsoft (R) C/C++ 최적화 컴파일러 버전 19.29.30133(x64)

Copyright (c) Microsoft Corporation. All rights reserved.

CMakeCXXCompilerABI.cpp

cl /c /Zi /W2 /WX- /diagnostics:column /Od /Ob0 /D \_MBCS /D WIN32 /D \_WINDOWS /D “CMAKE\_INTDIR=“Debug”” /Gm- /EHsc /RTC1 /MDd /GS /fp:precise /Zc:wchar\_t /Zc:forScope /Zc:inline /GR /Fo"cmTC\_61cdc.dir\Debug\" /Fd"cmTC\_61cdc.dir\Debug\vc142.pdb" /external:W2 /Gd /TP /errorReport:queue “C:\Program Files\CMake\share\cmake-3.21\Modules\CMakeCXXCompilerABI.cpp”

cmTC\_61cdc.vcxproj → C:\D\S4R\Slicer-build\CMakeFiles\CMakeTmp\Debug\cmTC\_61cdc.exe

Determining if files stdint.h exist passed with the following output:  
Change Dir: C:/D/S4R/Slicer-build/CMakeFiles/CMakeTmp

Run Build Command(s):C:/Program Files (x86)/Microsoft Visual Studio/2019/Community/MSBuild/Current/Bin/MSBuild.exe cmTC\_8cc03.vcxproj /p:Configuration=Debug /p:Platform=x64 /p:VisualStudioVersion=16.0 /v:m && .NET Framework용 Microsoft (R) Build Engine 버전 16.11.0+0538acc04

Copyright (C) Microsoft Corporation. All rights reserved.

Microsoft (R) C/C++ 최적화 컴파일러 버전 19.29.30133(x64)

Copyright (c) Microsoft Corporation. All rights reserved.

HAVE\_STDINT\_H.c

cl /c /Zi /W2 /WX- /diagnostics:column /Od /Ob0 /D \_MBCS /D WIN32 /D \_WINDOWS /D “CMAKE\_INTDIR=“Debug”” /Gm- /RTC1 /MDd /GS /fp:precise /Zc:wchar\_t /Zc:forScope /Zc:inline /Fo"cmTC\_8cc03.dir\Debug\" /Fd"cmTC\_8cc03.dir\Debug\vc142.pdb" /external:W2 /Gd /TC /errorReport:queue /bigobj “C:\D\S4R\Slicer-build\CMakeFiles\CheckIncludeFiles\HAVE\_STDINT\_H.c”

cmTC\_8cc03.vcxproj → C:\D\S4R\Slicer-build\CMakeFiles\CMakeTmp\Debug\cmTC\_8cc03.exe

Performing C SOURCE FILE Test C\_HAS\_WARNING-W3 succeeded with the following output:  
Change Dir: C:/D/S4R/Slicer-build/CMakeFiles/CMakeTmp

Run Build Command(s):C:/Program Files (x86)/Microsoft Visual Studio/2019/Community/MSBuild/Current/Bin/MSBuild.exe cmTC\_4c557.vcxproj /p:Configuration=Debug /p:Platform=x64 /p:VisualStudioVersion=16.0 /v:m && .NET Framework용 Microsoft (R) Build Engine 버전 16.11.0+0538acc04

Copyright (C) Microsoft Corporation. All rights reserved.

Microsoft (R) C/C++ 최적화 컴파일러 버전 19.29.30133(x64)

Copyright (c) Microsoft Corporation. All rights reserved.

src.c

cl /c /Zi /W3 /WX- /diagnostics:column /Od /Ob0 /D \_MBCS /D WIN32 /D \_WINDOWS /D “C\_HAS\_WARNING-W3” /D “CMAKE\_INTDIR=“Debug”” /Gm- /RTC1 /MDd /GS /fp:precise /Zc:wchar\_t /Zc:forScope /Zc:inline /Fo"cmTC\_4c557.dir\Debug\" /Fd"cmTC\_4c557.dir\Debug\vc142.pdb" /external:W3 /Gd /TC /errorReport:queue /bigobj “C:\D\S4R\Slicer-build\CMakeFiles\CMakeTmp\src.c”

cmTC\_4c557.vcxproj → C:\D\S4R\Slicer-build\CMakeFiles\CMakeTmp\Debug\cmTC\_4c557.exe

Source file was:  
int main(void) { return 0; }  
Performing C++ SOURCE FILE Test CXX\_HAS\_WARNING-W3 succeeded with the following output:  
Change Dir: C:/D/S4R/Slicer-build/CMakeFiles/CMakeTmp

Run Build Command(s):C:/Program Files (x86)/Microsoft Visual Studio/2019/Community/MSBuild/Current/Bin/MSBuild.exe cmTC\_65398.vcxproj /p:Configuration=Debug /p:Platform=x64 /p:VisualStudioVersion=16.0 /v:m && .NET Framework용 Microsoft (R) Build Engine 버전 16.11.0+0538acc04

Copyright (C) Microsoft Corporation. All rights reserved.

Microsoft (R) C/C++ 최적화 컴파일러 버전 19.29.30133(x64)

Copyright (c) Microsoft Corporation. All rights reserved.

src.cxx

cl /c /Zi /W3 /WX- /diagnostics:column /Od /Ob0 /D \_MBCS /D WIN32 /D \_WINDOWS /D “CXX\_HAS\_WARNING-W3” /D “CMAKE\_INTDIR=“Debug”” /Gm- /EHsc /RTC1 /MDd /GS /fp:precise /Zc:wchar\_t /Zc:forScope /Zc:inline /GR /Fo"cmTC\_65398.dir\Debug\" /Fd"cmTC\_65398.dir\Debug\vc142.pdb" /external:W3 /Gd /TP /errorReport:queue /bigobj /bigobj “C:\D\S4R\Slicer-build\CMakeFiles\CMakeTmp\src.cxx”

cmTC\_65398.vcxproj → C:\D\S4R\Slicer-build\CMakeFiles\CMakeTmp\Debug\cmTC\_65398.exe

Source file was:  
int main() { return 0;}  
Performing C++ SOURCE FILE Test have\_avx\_extensions\_var succeeded with the following compile output:  
Change Dir: C:/D/S4R/Slicer-build/CMakeFiles/CMakeTmp

Run Build Command(s):C:/Program Files (x86)/Microsoft Visual Studio/2019/Community/MSBuild/Current/Bin/MSBuild.exe cmTC\_eee97.vcxproj /p:Configuration=Debug /p:Platform=x64 /p:VisualStudioVersion=16.0 /v:m && .NET Framework용 Microsoft (R) Build Engine 버전 16.11.0+0538acc04

Copyright (C) Microsoft Corporation. All rights reserved.

Microsoft (R) C/C++ 최적화 컴파일러 버전 19.29.30133(x64)

Copyright (c) Microsoft Corporation. All rights reserved.

src.cxx

cl /c /Zi /W3 /WX- /diagnostics:column /Od /Ob0 /D \_MBCS /D WIN32 /D \_WINDOWS /D have\_avx\_extensions\_var /D “CMAKE\_INTDIR=“Debug”” /Gm- /EHsc /RTC1 /MDd /GS /arch:AVX /fp:precise /Zc:wchar\_t /Zc:forScope /Zc:inline /GR /Fo"cmTC\_eee97.dir\Debug\" /Fd"cmTC\_eee97.dir\Debug\vc142.pdb" /external:W3 /Gd /TP /errorReport:queue /bigobj /bigobj /bigobj “C:\D\S4R\Slicer-build\CMakeFiles\CMakeTmp\src.cxx”

cmTC\_eee97.vcxproj → C:\D\S4R\Slicer-build\CMakeFiles\CMakeTmp\Debug\cmTC\_eee97.exe

…and run output:

Return value: 1  
Source file was:

```
#include <immintrin.h>
int main()
{
  __m256 a, b, c;
  const float src[8] = { 1.0f, 2.0f, 3.0f, 4.0f, 5.0f, 6.0f, 7.0f, 8.0f };
  float dst[8];
  a = _mm256_loadu_ps( src );
  b = _mm256_loadu_ps( src );
  c = _mm256_add_ps( a, b );
  _mm256_storeu_ps( dst, c );

  for( int i = 0; i < 8; i++ ){
    if( ( src[i] + src[i] ) != dst[i] ){
      return -1;
    }
  }

  return 0;
}

```

Performing C++ SOURCE FILE Test have\_avx2\_extensions\_var succeeded with the following compile output:  
Change Dir: C:/D/S4R/Slicer-build/CMakeFiles/CMakeTmp

Run Build Command(s):C:/Program Files (x86)/Microsoft Visual Studio/2019/Community/MSBuild/Current/Bin/MSBuild.exe cmTC\_7000e.vcxproj /p:Configuration=Debug /p:Platform=x64 /p:VisualStudioVersion=16.0 /v:m && .NET Framework용 Microsoft (R) Build Engine 버전 16.11.0+0538acc04

Copyright (C) Microsoft Corporation. All rights reserved.

Microsoft (R) C/C++ 최적화 컴파일러 버전 19.29.30133(x64)

Copyright (c) Microsoft Corporation. All rights reserved.

src.cxx

cl /c /Zi /W3 /WX- /diagnostics:column /Od /Ob0 /D \_MBCS /D WIN32 /D \_WINDOWS /D have\_avx2\_extensions\_var /D “CMAKE\_INTDIR=“Debug”” /Gm- /EHsc /RTC1 /MDd /GS /arch:AVX2 /fp:precise /Zc:wchar\_t /Zc:forScope /Zc:inline /GR /Fo"cmTC\_7000e.dir\Debug\" /Fd"cmTC\_7000e.dir\Debug\vc142.pdb" /external:W3 /Gd /TP /errorReport:queue /bigobj /bigobj /bigobj “C:\D\S4R\Slicer-build\CMakeFiles\CMakeTmp\src.cxx”

cmTC\_7000e.vcxproj → C:\D\S4R\Slicer-build\CMakeFiles\CMakeTmp\Debug\cmTC\_7000e.exe

…and run output:

Return value: 1  
Source file was:

```
#include <immintrin.h>
int main()
{
  __m256i a, b, c;
  const int src[8] = { 1, 2, 3, 4, 5, 6, 7, 8 };
  int dst[8];
  a = _mm256_loadu_si256( (__m256i*)src );
  b = _mm256_loadu_si256( (__m256i*)src );
  c = _mm256_add_epi32( a, b );
  _mm256_storeu_si256( (__m256i*)dst, c );

  for( int i = 0; i < 8; i++ ){
    if( ( src[i] + src[i] ) != dst[i] ){
      return -1;
    }
  }

  return 0;
}
```

---

<div class="post-metadata">

**Author:** ![kookoo9999](https://sea2.discourse-cdn.com/flex002/user_avatar/discourse.slicer.org/kookoo9999/32/12394_2.png) [@kookoo9999](https://discourse.slicer.org/u/kookoo9999)\
**Post date:** [September 23, 2021, 6:48am UTC](https://discourse.slicer.org/t/failed-build-slicer-in-windows10-with-visual-studio-2017-qt-5-10-1/19718/24 "2021-09-23T06:48:31Z")

</div>

![image](https://us1.discourse-cdn.com/flex002/uploads/slicer/original/3X/f/e/fe01573b5773c03ca416a687f451dc8e3b8f65ec.png)  
 ![image](https://us1.discourse-cdn.com/flex002/uploads/slicer/original/3X/2/1/211ab880f725997cac73f49a4013183e6fc8c936.png)  
 ![image](https://us1.discourse-cdn.com/flex002/uploads/slicer/original/3X/8/7/876544852abbf74fcf44e80a7afe3ae2ff2a83c6.png)  
 ![image](https://us1.discourse-cdn.com/flex002/uploads/slicer/original/3X/6/0/60ed330def094de582c426426c7fd0c9d6131292.png)

I’am trying again…

[Next page](https://discourse.slicer.org/t/failed-build-slicer-in-windows10-with-visual-studio-2017-qt-5-10-1/19718.md?page=2)
